{"text_format":"1","workbook":"xlsx","n_sheets":6,"sheets":["4. Implementation Plan","Dropdowns","DataLookupValues","LiaisonList","dataDistrictList","dataSchoolInfo"],"not_rendered":{"charts":0,"images":0,"macros":1,"external_links":5,"defined_names":221,"comments":0,"pivot_tables":0},"unopened":[],"bounds":{"document_bytes":16777216,"sheet_cells":100000,"rows_first":2000,"rows_last":500,"rows_between":2000,"halvings":0,"cell_chars":16384,"cell_head_chars":4096},"cells_cut":0,"cells_raw":0,"read":"whole","date_system":"1900"}

{"sheet":"4. Implementation Plan","index":0,"n_rows":82,"n_cols":27,"rows_kept":82,"cut":false,"hidden":false,"merged":[[67,2,67,11],[42,9,42,13],[45,9,45,13],[46,9,46,13],[50,9,50,13],[49,9,49,13],[51,9,51,13],[41,9,41,13],[66,2,66,11],[42,2,42,6],[43,9,43,13],[44,9,44,13],[26,9,26,13],[26,14,26,24],[26,2,26,6],[47,2,47,6],[48,2,48,6],[47,9,47,13],[48,9,48,13],[47,14,47,24],[48,14,48,24],[39,2,39,6],[27,14,27,24],[38,9,38,13],[28,2,28,6],[29,2,29,6],[30,2,30,6],[1,2,1,6],[18,3,18,6],[10,3,10,6],[14,7,14,11],[15,7,15,11],[16,7,16,11],[17,7,17,11],[18,7,18,11],[12,3,12,6],[13,3,13,6],[14,3,14,6],[15,3,15,6],[16,3,16,6],[17,3,17,6],[6,7,8,11],[9,7,9,11],[10,7,10,11],[11,7,11,11],[12,7,12,11],[3,2,3,8],[4,2,4,8],[11,3,11,6],[9,3,9,6],[64,14,64,24],[52,14,52,24],[53,14,53,24],[53,2,53,6],[58,9,58,13],[52,2,52,6],[40,2,40,6],[51,2,51,6],[51,14,51,24],[59,2,59,6],[59,14,59,24],[40,14,40,24],[54,2,54,6],[55,2,55,6],[63,2,63,6],[63,14,63,24],[62,14,62,24],[52,9,52,13],[53,9,53,13],[54,9,54,13],[55,9,55,13],[61,14,61,24],[58,2,58,6],[58,14,58,24],[6,1,8,1],[21,2,22,2],[21,3,22,6],[25,2,25,6],[19,7,22,11],[56,9,56,13],[57,9,57,13],[40,9,40,13],[59,9,59,13],[23,2,23,6],[6,2,8,6],[24,2,24,13],[28,9,28,13],[29,9,29,13],[30,9,30,13],[37,9,37,13],[31,9,31,13],[32,9,32,13],[36,9,36,13],[33,9,33,13],[27,2,27,6],[36,2,36,6],[33,2,33,6],[35,2,35,6],[81,3,81,5],[81,8,81,11],[25,9,25,13],[34,14,34,24],[38,14,38,24],[39,14,39,24],[35,14,35,24],[36,14,36,24],[33,14,33,24],[28,14,28,24],[29,14,29,24],[30,14,30,24],[37,14,37,24],[31,14,31,24],[25,14,25,24],[60,2,60,6],[56,2,56,6],[57,2,57,6],[57,14,57,24],[56,14,56,24],[60,14,60,24],[61,2,61,6],[80,8,80,11],[73,3,73,5],[74,3,74,5],[75,3,75,5],[76,3,76,5],[77,3,77,5],[78,3,78,5],[79,3,79,5],[80,3,80,5],[74,8,74,11],[75,8,75,11],[76,8,76,11],[77,8,77,11],[78,8,78,11],[79,8,79,11],[73,8,73,11],[41,2,41,6],[46,2,46,6],[45,2,45,6],[34,2,34,6],[27,9,27,13],[34,9,34,13],[72,2,72,5],[13,7,13,11],[43,2,43,6],[50,2,50,6],[64,2,64,6],[60,9,60,13],[61,9,61,13],[62,9,62,13],[63,9,63,13],[64,9,64,13],[62,2,62,6],[71,2,71,11],[72,8,72,11],[65,2,65,11],[35,9,35,13],[32,2,32,6],[68,2,68,11],[55,14,55,24],[54,14,54,24],[49,2,49,6],[43,14,43,24],[44,2,44,6],[44,14,44,24],[39,9,39,13],[31,2,31,6],[37,2,37,6],[32,14,32,24],[41,14,41,24],[49,14,49,24],[50,14,50,24],[42,14,42,24],[45,14,45,24],[46,14,46,24],[38,2,38,6]]}
[]
[null,null,{"$f":"valDistrName","v":"Ashland"}]
[]
[null,null,"Plans for the Use of ESSER III Funds:\n\nThe United States Department of Education (USED) is requiring two plans from all recipients of ESSER III funds: \n\n     1)  A plan for the safe return to in-person instruction and continuity of services\n        The requirement for this plan is likely met by your District Reopening Plan submitted to DESE in August of 2020, along with any\n           subsequent amendments (see Tab 3 Assurances). It will need to be revisited and revised as necessary every 6 months, including\n           soliciting stakeholder input and considering changes to CDC guidance.\n   2)  A plan for the Use of ESSER III Funds, based on broad stakeholder input, and addressing the following:\n         • The district's prevention and mitigation strategies, including extent district has adopted CDC recommendations ( Step 4.4)\n            •  How the district will use its 20% reservation of ESSER III funds to address loss of instructional time with evidence-\n            based interventions (Step 4.2 and Tab 6, Budget)\n          •  How the district will spend the remainder of its ESSER III funds for allowable expenditures (Tab 5) and budget (Tab 6)\n            •  How the use of ESSER III funds will respond to the academic, social, emotional and mental health needs of all students, \n                especially those disproportionately impacted by the COVID-19 pandemic (Tab 4.2, Tab 4.3), including:"]
[null,null,"                            •  students from low-income families\n                            •  students of color\n                            •  English learners\n                            •  students with disabilities\n                            •  students experiencing homelessness\n                            •  students in foster care\n                            •  migratory students\n                            •  students who are incarcerated\n                            •  other underserved students\n\n      This application, when fully and thoughtfully completed, along with your District Reopening\n     Plans, will constitute the plans required by USED. These plans must be published on your website and must be accessible to\n      families in a language they understand, either translated in writing or orally, as well as in an accessible format for those with disabilities.\n\n     You should expect that DESE will be collecting data and other information from you as a result of implementation of\n    your plans for and use of ESSER funds."]
[null,null," "]
[null,"Step 4.1\nof 4.4","ESSER III regulations require that the stakeholder groups below be meaningfully consulted as part of the planning process for use of ESSER III funds. Which of the following groups have you consulted with? (check all that apply)",null,null,null,null,"If you have not yet consulted with this group in planning for use of ESSER III funds, when and how do you plan to get their input?"]
[]
[]
[null,null,null,"Students",null,null,null,null,null,null,null,null,null,null,null,null,null,null,null,null,null,null,null,null,null,true,{"$f":"IF($Z10=TRUE, \"\", \"Red\")","v":""}]
[null,null,null,"Families",null,null,null,null,null,null,null,null,null,null,null,null,null,null,null,null,null,null,null,null,null,true,{"$f":"IF($Z11=TRUE, \"\", \"Red\")","v":""}]
[null,null,null,"School and District administrators, including special education administrators",null,null,null,null,null,null,null,null,null,null,null,null,null,null,null,null,null,null,null,null,null,true,""]
[null,null,null,"School leaders",null,null,null,null,null,null,null,null,null,null,null,null,null,null,null,null,null,null,null,null,null,true,""]
[null,null,null,"Teachers",null,null,null,null,null,null,null,null,null,null,null,null,null,null,null,null,null,null,null,null,null,true,""]
[null,null,null,"Other educators",null,null,null,null,null,null,null,null,null,null,null,null,null,null,null,null,null,null,null,null,null,true,""]
[null,null,null,"School staff",null,null,null,null,null,null,null,null,null,null,null,null,null,null,null,null,null,null,null,null,null,true,""]
[null,null,null,"Unions representing educators and school staff",null,null,null,null,null,null,null,null,null,null,null,null,null,null,null,null,null,null,null,null,null,true,""]
[null,null,null,"Tribes*",null,null,null,"Not Applicable",null,null,null,null,null,null,null,null,null,null,null,null,null,null,null,null,null,false,"Red"]
[null,null,null,"Civil rights organizations (including disability rights organizations)*",null,null,null,null,null,null,null,null,null,null,null,null,null,null,null,null,null,null,null,null,null,true,""]
[null,null,null,"Stakeholders representing the interests of children with disabilities, English learners,",null,null,null,null,null,null,null,null,null,null,null,null,null,null,null,null,null,null,null,null,null,true,""]
[null,null,null,"children experiencing homelessness, children in foster care, migratory students, children "]
[null,null,null,"who are incarcerated, and other underserved students.*"]
[]
[null,null,"*To the extent present in or served by the district"]
[null,"Step 4.2 of 4.4","Evidence-Based Strategies, Interventions, and Supports: \nDescribe how ESSER III funds, including the required 20% reservation, will be used to respond to students' social, emotional, and academic needs through evidence-based interventions, how progress will be measured, and how/if chosen interventions address disproportionate impact of COVID-19 on underserved subgroups. Select from the following list of evidence-based interventions and provide a narrative at the bottom of this step for any of your district's evidence-based initiatives that are not listed. Note:  Your district's 20% reservation to address loss of instructional time must be spent on evidence-based interventions."]
[null,null,"Enhanced Core Instruction",null,null,null,null,"Our district is using ESSER III funds for this strategy","This strategy will address pandemic-related learning loss/disproportionate impact","What data will you use to measure progress?",null,null,null,null,"Does this strategy/intervention address the disproportionate impact of COVID-19 on underserved student subgroups (each major racial and ethnic group, students from low-income families, students with disabilities, English learners, gender, migrant students, students experiencing homelessness and students in foster care)? If yes, please explain which group(s) are being served, what impact is being addressed, and how this strategy/intervention will provide support."]
[null,null,"Expanding access to full-day, high-quality prekindergarten",null,null,null,null,"Select ","Select "]
[null,null,"Purchasing and/or expanding use of high-quality, aligned instructional materials (any content area) and associated professional development",null,null,null,null,"Select ","Select "]
[null,null,"Professional development for teachers and administrators re: culturally responsive teaching",null,null,null,null,"Select ","Select "]
[null,null,"Screening assessments and associated professional development (e.g., early literacy screening)",null,null,null,null,"Select ","Select "]
[null,null,"Expanding access to career-technical education (including \"After Dark\" district/vocational partnerships), innovation pathways, and advanced placement courses (including fee subsidies and teacher training)",null,null,null,null,"Select ","Select "]
[null,null,"Extending the school day/year and prioritizing  student access to additional time by student need",null,null,null,null,"Select ","Select "]
[null,null,"Tutoring programs and support, including early literacy tutoring (including training paraprofessionals) and peer tutoring programs. ",null,null,null,null,"Select ","Select "]
[null,null,"Developing or strengthening data cycles to facilitate and inform student learning and associated professional development and support personnel",null,null,null,null,"Select ","Select "]
[null,null,"Early college programs, particularly those focused on students underrepresented in higher education",null,null,null,null,"Select ","Select "]
[null,null,"Targeted Student Supports",null,null,null,null,"Our district is using ESSER III funds for:","This strategy will address pandemic-related learning loss/disproportionate impact","What data will you use to measure progress?",null,null,null,null,"Does this strategy/intervention address the disproportionate impact of COVID-19 on underserved student subgroups (each major racial and ethnic group, students from low-income families, students with disabilities, English learners, gender, migrant students, students experiencing homelessness and students in foster care)? If yes, please explain which group(s) are being served, what impact is being addressed, and how this strategy/intervention will provide support."]
[null,null,"Developing or expanding high quality co-teaching and inclusion models for students with disabilities and associated professional development",null,null,null,null,"Yes","Yes","Home grown assessment, Formal and Informal assessment data, Data associated with Individualized Educational Programs",null,null,null,null,"The staffing increase of  a special education teacher who will be able to best serve our students with disabilities throug a coteaching model will allow for more efficient service delivery for our students with disabilities."]
[null,null,"Acceleration academies (during school year vacations) and summer learning opportunities for individualized instruction and enrichment",null,null,null,null,"Select ","Select "]
[null,null,"Language support programs, including dual language and heritage language programs (students learning in-home/native language) and associated professional development ",null,null,null,null,"Select ","Select "]
[null,null,"Community-based afterschool programs for parents, including citizenship and ESL classes",null,null,null,null,"Select ","Select "]
[null,null,"Dropout prevention and recovery programs",null,null,null,null,"Select ","Select "]
[null,null,"Talent Development and Staffing",null,null,null,null,"Our district is using ESSER III funds for:","This strategy will address pandemic-related learning loss/disproportionate impact","What data will you use to measure progress?",null,null,null,null,"Does this strategy/intervention address the disproportionate impact of COVID-19 on underserved student subgroups (each major racial and ethnic group, students from low-income families, students with disabilities, English learners, gender, migrant students, students experiencing homelessness and students in foster care) ?  If  yes, please explain which group(s) are being served, what impact is being addressed, and how this strategy/intervention will provide support."]
[null,null,"Academic support staff, including academic coaches, interventionists, student teaching residency programs, paraprofessionals",null,null,null,null,"Select ","Select "]
[null,null,"Diversifying the educator workforce through recruitment and retention strategies",null,null,null,null,"Select ","Select "]
[null,null,"Strategies to staff hard-to-staff schools and positions with high-performing educators",null,null,null,null,"Select ","Select "]
[null,null,"Increasing staff and opportunities for arts, enrichment, world languages, athletics, and elective courses",null,null,null,null,"Select ","Select "]
[null,null,"Increasing high-quality common planning time for teachers and academic support staff",null,null,null,null,"Select ","Select "]
[null,null,"Developing leadership pipeline programs for schools",null,null,null,null,"Select ","Select "]
[null,null,"Labor-management partnerships to improve student performance",null,null,null,null,"Select ","Select "]
[null,null,"Conditions for Student Success - Social/Emotional and Mental Health Supports",null,null,null,null,"Our district is using ESSER III funds for:","This strategy will address pandemic-related learning loss/disproportionate impact","What data will you use to measure progress?",null,null,null,null,"Does this strategy/intervention address the disproportionate impact of COVID-19 on underserved student subgroups (each major racial and ethnic group, students from low-income families, students with disabilities, English learners, gender, migrant students, students experiencing homelessness and students in foster care)? If yes, please explain which group(s) are being served, what impact is being addressed, and how this strategy/intervention will provide support."]
[null,null,"Increasing personnel and services to support holistic student needs, including school guidance and adjustment counselors, nurses, psychologists, and/or social workers",null,null,null,null,"Yes","Yes","Formal and informal assessment data, including but not limited to: student surveys and DESSA",null,null,null,null,"Yes, the additional staffing will provide our counselors an opportunity to better serve all students, especially those who were most severely impacted by the pandemic. We are especially focused on our minorty students, students of color, and our LGBTQ+  population. Our counselors will not only be able to run groups for these students and be there to support them, they will also train staff in how to best support our various student subgroups."]
[null,null,"Building/strengthening partnerships with community-based organizations to increase student/family access to services for mental/physical health and well-being",null,null,null,null,"Select ","Select "]
[null,null,"Working with community-based organizations that provide enrichment during the school day and/or out of school time",null,null,null,null,"Select ","Select "]
[null,null,"Arranging for wraparound services to be provided at schools",null,null,null,null,"Select ","Select "]
[null,null,"Engaging community partners to build capacity among educators and support personnel to implement equitable and culturally responsive learning environments",null,null,null,null,"Select ","Select "]
[null,null,"Create transitional programs, partnering with community based organizations, for students with mental health or behavioral-related absences returning to school",null,null,null,null,"Select ","Select "]
[null,null,"Parent-teacher home visiting programs to build positive relationships between home and school",null,null,null,null,"Select ","Select "]
[null,null,"Facilities improvements to create healthy and safe school environments",null,null,null,null,"Select ","Select "]
[null,null,"Other Interventions/Strategies/Supports\nUse this section to describe evidence-based strategies your district will fund with ESSER III that are not listed above",null,null,null,null,null,"This strategy will address pandemic-related learning loss/disproportionate impact","What data will you use to measure progress?",null,null,null,null,"Does this strategy/intervention address the disproportionate impact of COVID-19 on underserved student subgroups (each major racial and ethnic group, students from low-income families, students with disabilities, English learners, gender, migrant students, students experiencing homelessness and students in foster care)? If yes, please explain which group(s) are being served, what impact is being addressed, and how this strategy/intervention will provide support."]
[null,null,"Increasing the number of staff for our Middle School, in order to shrink class size and more easily mitigate potential learning loss on a holistic level.",null,null,null,null,null,"Yes","Assessment data including but not limited to: ACCESS, MCAS, home grown assessments",null,null,null,null,"Yes, research has shown that class size has a direct impact on student success. The additional staff will allow our students and teachers to have a more beneficial staff/student ratio. Therefore, we wil be able to better identify specific student needs and address these needs faster and more efficiently. Included in this staffing is the addition of a special education teacher who will be able to best serve our students with disabilities throug a coteaching model. In addition, the smaller class sizes will allow for greater attention for students who are struggling with learning loss due to the pandemic."]
[null,null,null,null,null,null,null,null,"Select "]
[null,null,null,null,null,null,null,null,"Select "]
[null,null,null,null,null,null,null,null,"Select "]
[null,null,null,null,null,null,null,null,"Select "]
[null,null,null,null,null,null,null,null,"Select "]
[]
[null,"Step 4.3 of 4.4","Equitable Use of ESSER III Funds"]
[null," ","How is your district taking educational equity into account when planning for expending your ESSER III funds?\nFor example, \n     1)  allocating funds both to schools and districtwide activities based on student needs, and \n     2)  implementing an equitable and inclusive return to in-person learning by, for example, avoiding over-use of exclusionary discipline and\n           creating a positive and supportive learning environment for all students."]
[null,null,"We have surveyed our staff and community regarding their hopes and desires as to how we utilize these funds. The community overwhelmingly supported additional staffing at the middle school level in order to decrease our staff/student ratio for our core subject areas. We believe this strategy will ultimately serve our entire district, as students will be better served at the middle school, which will ultimately mean they are better prepared for their high school years. In addition, the decreased class sizes, will allow for a more efficient process to identify and support students in need, as well as provide these students with the necessary resources and interventions to ensure their success. "]
[]
[]
[null,"Step 4.4\nof 4.4"," CDC School Safety Recommendations  \nThis information will come from your District Reopening Plan as well as any supplemental/revised reopening policies for your district."]
[null,null,"  CDC Recommendation",null,null,null,"   Does your district have a policy or policies on this topic?","If \"Yes,\" is it described in your District Reopening Plan?","If you have a policy but it is not described in your District Reopening Plan, please briefly describe here."]
[null,null,1,"Universal and correct wearing of masks",null,null,"Yes","Yes"]
[null,null,2,"Modifying facilities to allow for physical distancing (e.g., use of cohorts/podding)",null,null,"Yes","Yes"]
[null,null,3,"Handwashing and respiratory etiquette",null,null,"Yes","Yes"]
[null,null,4,"Cleaning and maintaining healthy facilities, including improving ventilation",null,null,"Yes","Yes"]
[null,null,5,"Contact tracing, isolation, quarantine in collaboration with health departments",null,null,"Yes","Yes"]
[null,null,6,"Diagnostic and screening testing",null,null,"Yes","Yes"]
[null,null,7,"Efforts to provide vaccination to school communities",null,null,"Yes","Yes"]
[null,null,8,"Appropriate accommodations for children with disabilities with respect to health and safety policies",null,null,"Yes","Yes"]
[null,null,9,"Coordination with state and local health officials",null,null,"Yes","Yes"]

{"sheet":"Dropdowns","index":1,"n_rows":127,"n_cols":4,"rows_kept":127,"cut":false,"hidden":true,"merged":[]}
["Budget Worksheet Dropdowns","YesNo","Rate","Assurances"]
["Primary Functions","Select One","select","Select One"]
["Select One","Yes","per hour","We are a single school district"]
["Activities under ESSA, IDEA, Perkins or AEFLA","No","per day","We have one school per grade"]
["Coordinating activities with public health agencies",null,"flat","We enroll fewer than 1000 students"]
["Meeting unique needs of special student populations","YesNoNA",null,"Exceptional/Uncontrollable circumstances"]
["Activities addressing learning loss ","Select One"]
["Improving district preparedness and response to COVID-19","Yes"]
["Training and PD on sanitation and disease containment","No"]
["Supplies to sanitize schools and district facilities","N/A"]
["School facility repairs and improvements to reduce health risks"]
["Activities related to improving indoor air quality in school facilities","Fiscal Year"]
["Coordinating systems for students during long-term closures","Select One"]
["Acquiring education technology for students to facilitate remote learning","FY2021"]
["Providing mental health services and supports","FY2022"]
["Planning/implementing summer learning and/or afterschool programs"]
["Other activities re: maintaining district activities and continuing staff employment","YesOnly"]
[null,"Select "]
[null,"Yes"]
[]
[]
[]
[]
[]
[]
[]
[]
[]
[]
[]
[]
[]
[]
[]
[]
[]
[]
[]
[]
[]
[]
[]
[]
[]
[]
[]
[]
[]
[]
[]
[]
[]
[]
[]
[]
[]
[]
["Budget Categories"]
["Administrator Salaries"]
["Select One"]
["Grant Program Manager/Coordinator "]
["Other "]
["InstructionalProf Staff Salaries"]
["Select One"]
["Classroom Teachers  "]
["Instructional Coaches "]
["Certified Specialist Teachers (providing individualized instruction)  "]
["Instructional Coordinators and Team Leaders  "]
["Medical / Therapeutic Services "]
["Librarians and Media Center Directors "]
["Professional Development Directors/Coordinators  "]
["Guidance or School Adjustment Counselors, Social Workers  "]
["Psychological Service Providers "]
["School Physicians and School Nurses  "]
["Other  "]
["Support Staff Salaries"]
["Select One"]
["Non-Clerical Paraprofessionals/Instructional Assistants "]
["Secretary/Bookkeeper/Clerical Support  "]
["Parent Liaisons"]
["Other "]
["Stipends"]
["Select One"]
["Teacher/ Instructional Staff Professional Days"]
["Administrators "]
["Other "]
["Support Staff"]
["Travel"]
["Select One"]
["Grant Program Manager/Coordinator (supervisory)"]
["Certified Classroom Teachers (providing group instruction) "]
["Certified Specialist Teachers (providing individualized instruction)"]
["Non-Clerical Paraprofessionals/Instructional Assistants"]
["Other "]
["Contractual Services"]
["Select One"]
["Instructional Services "]
["Consultants/Professional  Development for Teachers & Support Staff "]
["Substitutes (long and/or short term)"]
["Non-Clerical Paraprofessionals/Instructional Assistants"]
["Secretary/Bookkeeper/Clerical Support "]
["Contracted Service Providers -- Private School Services "]
["Contracted Services Providers -- Other Student Services "]
["Other "]
["Supplies and Materials"]
["Select One"]
["Textbooks and Related Software/Media/Materials "]
["Instructional Technology"]
["Other Instructional Materials (non-testing/assessment)"]
["Testing and Assessment Materials"]
["General Classroom Supplies "]
["Office Supplies  "]
["Other "]
["Other costs"]
["Select One"]
["Memberships/Subscriptions"]
["Advertising  "]
["Student Transportation Services "]
["Rental/Lease of Equipment"]
["Maintenance of Equipment"]
["Maintenance of Technology "]
["Tuition to Non-Public Schools "]
["Tuition to Out-of-State Schools "]
["Tuition to Collaboratives"]
["Rental Lease of Buildings  "]
["Utility Services/ Telephone "]
["Other  "]

{"sheet":"DataLookupValues","index":2,"n_rows":22,"n_cols":6,"rows_kept":22,"cut":false,"hidden":true,"merged":[]}
["Workbook Information"]
[]
[]
[]
["District Information"]
["District value",17,null,null,"Liasons"]
["District Name:",{"$f":"VLOOKUP(valDistr,dataDistr,3,FALSE)","v":"Ashland"},"district code",{"$f":"LEFT(VLOOKUP(valDistr,dataDistr,2,FALSE),4)","v":"0014"},"Name",{"$f":"VLOOKUP(valDistr,dataDistr,12,FALSE)","v":"Alex Lilley"}]
["Address1",{"$f":"VLOOKUP(valDistr,dataDistr,7,FALSE)","v":"87 West Union Street"},null,null,"Phone",{"$f":"VLOOKUP(valDistr,dataDistr,13,FALSE)","v":"781-338-6212"}]
["Address2",{"$f":"IF(VLOOKUP(valDistr,dataDistr,8,FALSE)=0,\"\",VLOOKUP(valDistr,dataDistr,8,FALSE))","v":""},null,null,"Email",{"$f":"VLOOKUP(valDistr,dataDistr,14,FALSE)","v":"alex.j.lilley@mass.gov"}]
["City, State, ZIP",{"$f":"VLOOKUP(valDistr,dataDistr,9,FALSE)&\", \"&VLOOKUP(valDistr,dataDistr,10,FALSE)&\" \"&VLOOKUP(valDistr,dataDistr,11,FALSE)","v":"Ashland, MA 01721"}]
["District Enrollment",{"$f":"VLOOKUP(valDistr,dataDistr,17,FALSE)","v":752392},"EL Enrollment",{"$f":"VLOOKUP(valDistr,dataDistr,16,FALSE)","v":162}]
["Low Inc Methods TI"]
["SELECT ONE",null,"TitleI Status"]
["Oct Eco Dis",null,1]
["Oct Eco Dis x 1.6",null,2,"SW"]
["March Eco Dis",null,3,"TA"]
["March Eco Dis x 1.6",null,4,"NT"]
["Other ",null,5,"CL"]
[]
["Homeless Enrollment",{"$f":"VLOOKUP(valDistr,dataDistr,18,FALSE)","v":18}]
["SLE Gaps",{"$f":"VLOOKUP(valDistr,dataDistr,19,FALSE)","v":"Yes"}]
["FY20 district Enrollment",{"$f":"VLOOKUP(valDistr,dataDistr,21,FALSE)","v":2706}]

{"sheet":"LiaisonList","index":3,"n_rows":8,"n_cols":3,"rows_kept":8,"cut":false,"hidden":true,"merged":[]}
["Aneesh Sahni","781-338-3532","aneesh.sahni@doe.mass.edu"]
["Alex Lilley","781-338-6212","alilley@doe.mass.edu"]
["Beth O'Connell","781-338-3132","EO'Connell@doe.mass.edu"]
["Deb Walker","781-338-3127","djwalker@doe.mass.edu"]
["Ellie Rounds-Bloom","781-338-3128","erounds-bloom@doe.mass.edu"]
["Julia Foodman","781-338-3577","jfoodman@doe.mass.edu"]
["Russ Fleming","781-338-6529","RFleming@doe.mass.edu"]
["Sue Mazzarella","781-338-3587","smazzarella@doe.mass.edu"]

{"sheet":"dataDistrictList","index":4,"n_rows":400,"n_cols":22,"rows_kept":400,"cut":false,"hidden":true,"merged":[]}
[1,"DISTRICT","OrgName","Org Type","Function","Contact Name","ADDR 1","ADDR 2","City","State","Zip","Liaison's Name","Liaison's Number","Liaison's Email",null,"March 2019 nElCOUNT_sum","ESSER III Allocation.6.28","HOMELESS, K-12","SLE Gaps?","FY20 LowInc","March2021Enrolled","El Count March 2020"]
[2,"04450000","Abby Kelley Foster Charter Public (District)","Charter District","Charter School Leader","Brian Haas","10 New Bond Street","","Worcester","MA","01606","Colleen Holforty","781-338-3522","colleen.e.holforty@mass.gov",null,140,3088585,12,"No",null,1425,195]
[3,"00010000","Abington","Public School District","Superintendent","Peter Schafer","1071 Washington St.","","Abington","MA","02351","Alex Lilley","781-338-6212","alex.j.lilley@mass.gov",null,100,1371563,13,"Yes",null,2078,157]
[4,"04120000","Academy Of the Pacific Rim Charter Public (District)","Charter District","Charter School Leader","Spencer Blasdale","1 Westinghouse Plaza Bldg B","","Hyde Park","MA","02136","Colleen Holforty","781-338-3522","colleen.e.holforty@mass.gov",null,68,2233749,3,"No",null,539,44]
[5,"06000000","Acton-Boxborough","Public School District","Superintendent","Peter Light","15 Charter Rd","","Acton","MA","01720","Sue Mazzarella","781-338-3587","susan.mazzarella@mass.gov",null,243,918304,12,"Yes",null,5221,259]
[6,"00030000","Acushnet","Public School District","Superintendent","Paula Bailey","708 Middle Road","Suite 1","Acushnet","MA","02743","Colleen Holforty","781-338-3522","colleen.e.holforty@mass.gov",null,10,688273,0,"Yes",null,890,5]
[7,"04300000","Advanced Math and Science Academy Charter (District)","Charter District","Charter School Leader","Ellen Linzey","201 Forest Street","","Marlborough","MA","01752","Sue Mazzarella","781-338-3587","susan.mazzarella@mass.gov",null,42,177017,0,"Yes",null,964,18]
[8,"00050000","Agawam","Public School District","Superintendent","Steven Lemanski","1305 Springfield St","Suite 1","Feeding Hills","MA","01030","Nancy Labrie","781-338-3536","nancy.h.labrie@mass.gov",null,185,4617049,26,"Yes",null,3375,167]
[9,"04090000","Alma del Mar Charter School (District)","Charter District","Charter School Leader","Will Gardner","515 Belleville Ave","","New Bedford","MA","02746","Alex Chiu","781-338-3586","alexandria.w.chiu@mass.gov",null,106,3127203,1,"No",null,800,244]
[10,"00070000","Amesbury","Public School District","Superintendent","Jared Fulgoni","5 Highland Street","","Amesbury","MA","01913","Russ Fleming","781-338-6259","russellw.fleming@mass.gov",null,31,1927437,8,"Yes",null,1816,36]
[11,"00080000","Amherst","Public School District","Superintendent","Michael Morris","170 Chestnut Street","","Amherst","MA","01002","Ellie Rounds-Bloom","781-338-3128","eleanor.rounds@mass.gov",null,170,1554521,20,"Yes",null,974,121]
[12,"06050000","Amherst-Pelham","Public School District","Superintendent","Michael Morris","170 Chestnut Street","","Amherst","MA","01002","Ellie Rounds-Bloom","781-338-3128","eleanor.rounds@mass.gov",null,84,1657509,14,"Yes",null,1275,93]
[13,"00090000","Andover","Public School District","Superintendent","Sheldon Berman","36 Bartlet Street","","Andover","MA","01810","Beth O'Connell","781-338-3132","elizabeth.a.o'connell@mass.gov",null,231,1254539,13,"Yes",null,5527,162]
[14,"35090000","Argosy Collegiate Charter School (District)","Charter District","Charter School Leader","Kristen Pavao","263 Hamlet Street","","Fall River","MA","02724","Julia Foodman","781-338-3577","julia.b.foodman@mass.gov",null,138,1900298,6,"No",null,567,108]
[15,"00100000","Arlington","Public School District","Superintendent","Kathleen Bodie","869 Massachusetts Avenue","","Arlington","MA","02476","Julia Foodman","781-338-3577","julia.b.foodman@mass.gov",null,275,1133653,9,"Yes",null,5720,251]
[16,"06100000","Ashburnham-Westminster","Public School District","Superintendent","Sandra Rehler","11 Oakmont Drive","","Ashburnham","MA","01430","Colleen Holforty","781-338-3522","colleen.e.holforty@mass.gov",null,32,1206075,6,"Yes",null,2175,36]
[17,"00140000","Ashland","Public School District","Superintendent","James Adams","87 West Union Street","","Ashland","MA","01721","Alex Lilley","781-338-6212","alex.j.lilley@mass.gov",null,162,752392,18,"Yes",null,2706,177]
[18,"08010000","Assabet Valley Regional Vocational Technical","Public School District","Superintendent","Ernest Houle","215 Fitchburg Street","","Marlborough","MA","01752","Ellie Rounds-Bloom","781-338-3128","eleanor.rounds@mass.gov",null,33,1098530,4,"Yes",null,1135,56]
[19,"06150000","Athol-Royalston","Public School District","Superintendent","Darcy Fernandes","1062 Pleasant Street","","Athol","MA","01331","Nancy Labrie","781-338-3536","nancy.h.labrie@mass.gov",null,26,3298701,20,"Yes",null,1417,42]
[20,"04910000","Atlantis Charter (District)","Charter District","Charter School Leader","Robert Beatty","991 Jefferson St","","Fall River","MA","02721","Alex Chiu","781-338-3586","alexandria.w.chiu@mass.gov",null,140,3295961,8,"Yes",null,1300,191]
[21,"00160000","Attleboro","Public School District","Superintendent","David Sawyer","100 Rathbun Willard Drive","","Attleboro","MA","02703","Alex Chiu","781-338-3586","alexandria.w.chiu@mass.gov",null,356,6263639,60,"Yes",null,5607,319]
[22,"00170000","Auburn","Public School District","Superintendent","Maryellen Brunelle","5 West Street","","Auburn","MA","01501","Colleen Holforty","781-338-3522","colleen.e.holforty@mass.gov",null,91,1411780,18,"Yes",null,2449,57]
[23,"00180000","Avon","Public School District","Superintendent","Christine Godino","1 Patrick Clark Drive","","Avon","MA","02322","Nancy Labrie","781-338-3536","nancy.h.labrie@mass.gov",null,24,509484,2,"Yes",null,677,51]
[24,"06160000","Ayer Shirley School District","Public School District","Superintendent","Mary Malone","115 Washington Street","","Ayer","MA","01432","Russ Fleming","781-338-6259","russellw.fleming@mass.gov",null,64,4133008,7,"Yes",null,1571,51]
[25,"00200000","Barnstable","Public School District","Superintendent","Meg Mayo-Brown","P O Box 955","","Hyannis","MA","02601","Alex Chiu","781-338-3586","alexandria.w.chiu@mass.gov",null,502,6063431,63,"Yes",null,4600,595]
[26,"35020000","Baystate Academy Charter Public School (District)","Charter District","Charter School Leader","Timothy Sneed","2001 Roosevelt Avenue","","Springfield","MA","01104","Beth O'Connell","781-338-3132","elizabeth.a.o'connell@mass.gov",null,61,3082777,8,"Yes",null,473,41]
[27,"00230000","Bedford","Public School District","Superintendent","Jonathan Sills","97 McMahon Road","","Bedford","MA","01730","Julia Foodman","781-338-3577","julia.b.foodman@mass.gov",null,155,385693,1,"Yes",null,2597,112]
[28,"00240000","Belchertown","Public School District","Superintendent","Brian Cameron","PO Box 841","","Belchertown","MA","01007","Beth O'Connell","781-338-3132","elizabeth.a.o'connell@mass.gov",null,22,1301951,5,"Yes",null,2127,32]
[29,"00250000","Bellingham","Public School District","Superintendent","Peter Marano","4 Mechanic Street","","Bellingham","MA","02019","Sue Mazzarella","781-338-3587","susan.mazzarella@mass.gov",null,46,1385986,64,"Yes",null,1946,49]
[30,"00260000","Belmont","Public School District","Superintendent","John Phelan","644 Pleasant Street","","Belmont","MA","02478","Alex Chiu","781-338-3586","alexandria.w.chiu@mass.gov",null,357,1002359,4,"Yes",null,4434,325]
[31,"04200000","Benjamin Banneker Charter Public (District)","Charter District","Charter School Leader","Sherley Bretous-Carre","21 Notre Dame Avenue","","Cambridge","MA","02140","Ellie Rounds-Bloom","781-338-3128","eleanor.rounds@mass.gov",null,20,1059528,7,"Yes",null,322,15]
[32,"04470000","Benjamin Franklin Classical Charter Public (District)","Charter District","Charter School Leader","Heather Zolnowski","500 Financial Park","","Franklin","MA","02038","Russ Fleming","781-338-6259","russellw.fleming@mass.gov",null,26,170448,1,"Yes",null,775,58]
[33,"00270000","Berkley","Public School District","Superintendent","Thomas Lynch","21 North Main Street","","Berkley","MA","02779","Russ Fleming","781-338-6259","russellw.fleming@mass.gov",null,6,661644,5,"Yes",null,826,9]
[34,"04140000","Berkshire Arts and Technology Charter Public (District)","Charter District","Charter School Leader","James White","1 Commercial Pl","PO Box 267","Adams","MA","01220","Russ Fleming","781-338-6259","russellw.fleming@mass.gov",null,3,935268,6,"Yes",null,368,5]
[35,"06180000","Berkshire Hills","Public School District","Superintendent","Peter Dillon","50 Main Street","PO Box 617","Stockbridge","MA","01262","Alex Chiu","781-338-3586","alexandria.w.chiu@mass.gov",null,40,1234552,14,"Yes",null,1161,56]
[36,"06200000","Berlin-Boylston","Public School District","Superintendent","Jeffrey Zanghi","215 Main Street","","Boylston","MA","01505","Beth O'Connell","781-338-3132","elizabeth.a.o'connell@mass.gov",null,9,263868,1,"Yes",null,1007,22]
[37,"00300000","Beverly","Public School District","Superintendent","Suzanne Charochak","70 Balch St.","","Beverly","MA","01915","Nancy Labrie","781-338-3536","nancy.h.labrie@mass.gov",null,164,4741978,77,"Yes",null,4581,179]
[38,"00310000","Billerica","Public School District","Superintendent","Timothy Piwowar","365 Boston Rd","","Billerica","MA","01821","Russ Fleming","781-338-6259","russellw.fleming@mass.gov",null,69,1835522,8,"Yes",null,4481,86]
[39,"08050000","Blackstone Valley Regional Vocational Technical","Public School District","Superintendent","Michael Fitzpatrick","65 Pleasant Street","","Upton","MA","01568","Alex Chiu","781-338-3586","alexandria.w.chiu@mass.gov",null,2,234924,2,"No",null,1229,6]
[40,"06220000","Blackstone-Millville","Public School District","Superintendent","Jason Defalco","175 Lincoln Street","","Blackstone","MA","01504","Sue Mazzarella","781-338-3587","susan.mazzarella@mass.gov",null,39,1260101,1,"Yes",null,1504,26]
[41,"08060000","Blue Hills Regional Vocational Technical","Public School District","Superintendent","Jill Rossetti","800 Randolph Street","","Canton","MA","02021","Alex Chiu","781-338-3586","alexandria.w.chiu@mass.gov",null,6,839368,5,"No",null,878,12]
[42,"00350000","Boston","Public School District","Superintendent","Brenda Cassellius","2300 Washington Street","","Roxbury","MA","02119","Julia Foodman","781-338-3577","julia.b.foodman@mass.gov",null,15262,276339451,3732,"Yes",null,45721,12892]
[43,"04490000","Boston Collegiate Charter (District)","Charter District","Charter School Leader","Shannah Varon","11 Mayhew Street","","Dorchester","MA","02125","Julia Foodman","781-338-3577","julia.b.foodman@mass.gov",null,29,2160578,2,"No",null,719,32]
[44,"04240000","Boston Day and Evening Academy Charter (District)","Charter District","Charter School Leader","Alison Hramiec","20 Kearsarge Ave","","Roxbury","MA","02119","Colleen Holforty","781-338-3522","colleen.e.holforty@mass.gov",null,46,2665833,41,"No",null,400,67]
[45,"04110000","Boston Green Academy Horace Mann Charter School (District)","Charter District","Charter School Leader","Matthew Holzer","20 Warren St.","","Brighton","MA","02135","Ellie Rounds-Bloom","781-338-3128","eleanor.rounds@mass.gov",null,68,3199056,33,"No",null,492,81]
[46,"04160000","Boston Preparatory Charter Public (District)","Charter District","Charter School Leader","Sharon Liszanckie","885 River Street","","Hyde Park","MA","02136","Julia Foodman","781-338-3577","julia.b.foodman@mass.gov",null,94,4127014,0,"No",null,667,127]
[47,"04810000","Boston Renaissance Charter Public (District)","Charter District","Charter School Leader","Alexandra Banhares-Buckmire","1415 Hyde Park Ave","","Hyde Park","MA","02136","Alex Lilley","781-338-6212","alex.j.lilley@mass.gov",null,109,5125444,4,"No",null,825,104]
[48,"00360000","Bourne","Public School District","Superintendent","Kerri Quinlan-Zhou","36 Sandwich Rd","","Bourne","MA","02532","Beth O'Connell","781-338-3132","elizabeth.a.o'connell@mass.gov",null,14,1971239,22,"Yes",null,1584,13]
[49,"00380000","Boxford","Public School District","Superintendent","Scott Morrison","28 Middleton Road","","Boxford","MA","01921","Russ Fleming","781-338-6259","russellw.fleming@mass.gov",null,6,693090,0,"Yes",null,649,6]
[50,"00400000","Braintree","Public School District","Superintendent","Frank Hackett","348 Pond Street","","Braintree","MA","02184","Ellie Rounds-Bloom","781-338-3128","eleanor.rounds@mass.gov",null,305,3591261,19,"Yes",null,5447,305]
[51,"00410000","Brewster","Public School District","Superintendent","Thomas Conrad","78 Eldredge Pkwy","","Orleans","MA","02653","Julia Foodman","781-338-3577","julia.b.foodman@mass.gov",null,10,603994,1,"No",null,414,19]
[52,"04170000","Bridge Boston Charter School (District)","Charter District","Charter School Leader","Craig Martin","435 Warren St.","","Roxbury","MA","02119","Beth O'Connell","781-338-3132","elizabeth.a.o'connell@mass.gov",null,77,2057872,5,"No",null,305,73]
[53,"06250000","Bridgewater-Raynham","Public School District","Superintendent","Derek Swenson","166 Mt. Prospect Street","","Bridgewater","MA","02324","Alex Lilley","781-338-6212","alex.j.lilley@mass.gov",null,113,1972683,16,"Yes",null,5193,139]
[54,"00430000","Brimfield","Public School District","Superintendent","Erin Nosek","320A Brookfield Rd","","Fiskdale","MA","01518","Russ Fleming","781-338-6259","russellw.fleming@mass.gov",null,2,385586,1,"Yes",null,255,3]
[55,"09100000","Bristol County Agricultural","Public School District","Superintendent","Adele Sands","135 Center Street","","Dighton","MA","02715","Nancy Labrie","781-338-3536","nancy.h.labrie@mass.gov",null,0,483145,6,"Yes",null,440,0]
[56,"08100000","Bristol-Plymouth Regional Vocational Technical","Public School District","Superintendent","Alexandre Magalhaes","207 Hart Street","","Taunton","MA","02780","Russ Fleming","781-338-6259","russellw.fleming@mass.gov",null,3,1330222,4,"No",null,1304,4]
[57,"00440000","Brockton","Public School District","Superintendent","Michael Thomas","43 Crescent Street","","Brockton","MA","02301","Sue Mazzarella","781-338-3587","susan.mazzarella@mass.gov",null,4240,34046089,597,"Yes",null,15092,3986]
[58,"04280000","Brooke Charter School (District)","Charter District","Charter School Leader","Kimberly Steadman","190 Cummins Highway","","Roslindale","MA","02131","Julia Foodman","781-338-3577","julia.b.foodman@mass.gov",null,133,8698299,10,"Yes",null,2065,164]
[59,"00450000","Brookfield","Public School District","Superintendent","Erin Nosek","320 Brookfield Rd","","Fiskdale","MA","01518","Russ Fleming","781-338-6259","russellw.fleming@mass.gov",null,1,532013,0,"No",null,252,1]
[60,"00460000","Brookline","Public School District","Superintendent","Benjamin Lummis","333 Washington Street","","Brookline","MA","02445","Julia Foodman","781-338-3577","julia.b.foodman@mass.gov",null,877,3667388,20,"Yes",null,6666,546]
[61,"00480000","Burlington","Public School District","Superintendent","Eric Conti","123 Cambridge Street","","Burlington","MA","01803","Sue Mazzarella","781-338-3587","susan.mazzarella@mass.gov",null,161,898558,6,"Yes",null,3382,167]
[62,"00490000","Cambridge","Public School District","Superintendent","Kenneth Salim","135 Berkshire Street","","Cambridge","MA","02141","Alex Lilley","781-338-6212","alex.j.lilley@mass.gov",null,548,7957907,151,"Yes",null,6240,390]
[63,"00500000","Canton","Public School District","Superintendent","Jennifer Fischer-Mueller","960 Washington Street","","Canton","MA","02021","Ellie Rounds-Bloom","781-338-3128","eleanor.rounds@mass.gov",null,83,929679,12,"Yes",null,3181,75]
[64,"04320000","Cape Cod Lighthouse Charter (District)","Charter District","Charter School Leader","Paul Niles","195 Route 137","","East Harwich","MA","02645","Ellie Rounds-Bloom","781-338-3128","eleanor.rounds@mass.gov",null,1,194173,0,"No",null,252,1]
[65,"08150000","Cape Cod Regional Vocational Technical","Public School District","Superintendent","Robert Sanborn","351 Pleasant Lake Avenue","","Harwich","MA","02645","Julia Foodman","781-338-3577","julia.b.foodman@mass.gov",null,17,952943,1,"No",null,623,13]
[66,"00510000","Carlisle","Public School District","Superintendent","James O'Shea","83 School Street","","Carlisle","MA","01741","Nancy Labrie","781-338-3536","nancy.h.labrie@mass.gov",null,18,170448,0,"Yes",null,589,11]
[67,"00520000","Carver","Public School District","Superintendent","Scott Knief","3 Carver Square Blvd.","","Carver","MA","02330","Nancy Labrie","781-338-3536","nancy.h.labrie@mass.gov",null,20,1242609,3,"Yes",null,1456,21]
[68,"06350000","Central Berkshire","Public School District","Superintendent","Laurie Casna","PO Box 299","Rt 8","Dalton","MA","01227","Alex Lilley","781-338-6212","alex.j.lilley@mass.gov",null,5,2576425,9,"Yes",null,1469,8]
[69,"00560000","Chelmsford","Public School District","Superintendent","Roger Lang","230 North Road","","Chelmsford","MA","01824","Russ Fleming","781-338-6259","russellw.fleming@mass.gov",null,202,1428108,20,"Yes",null,4780,202]
[70,"00570000","Chelsea","Public School District","Superintendent","Almudena Abeyta","500 Broadway","Room 216","Chelsea","MA","02150","Julia Foodman","781-338-3577","julia.b.foodman@mass.gov",null,2191,20732065,336,"Yes",null,6001,2123]
[71,"06320000","Chesterfield-Goshen","Public School District","Superintendent","Aaron Osborne","PO Box 300","","Chesterfield","MA","01012","Nancy Labrie","781-338-3536","nancy.h.labrie@mass.gov",null,null,177018,0,null,null,102,0]
[72,"00610000","Chicopee","Public School District","Superintendent","Lynn Clark","180 Broadway Street","","Chicopee","MA","01020","Beth O'Connell","781-338-3132","elizabeth.a.o'connell@mass.gov",null,453,22330824,90,"Yes",null,6687,405]
[73,"04180000","Christa McAuliffe Charter Public (District)","Charter District","Charter School Leader","Dayshel Reid","139 Newbury St","","Framingham","MA","01701","Sue Mazzarella","781-338-3587","susan.mazzarella@mass.gov",null,10,458302,0,"Yes",null,399,15]
[74,"04370000","City on a Hill Charter Public School Circuit Street (District)","Charter District","Charter School Leader","Kevin Taylor","15 Allerton Street","Suite 1","Roxbury","MA","02119","Julia Foodman","781-338-3577","julia.b.foodman@mass.gov",null,37,2911349,8,"No",null,284,68]
[75,"00630000","Clarksburg","Public School District","Superintendent","John Franzoni","777 West Crossroad","","Clarksburg","MA","01247","Sue Mazzarella","781-338-3587","susan.mazzarella@mass.gov",null,0,177018,0,"No",null,192,0]
[76,"00640000","Clinton","Public School District","Superintendent","Steven Meyer","150 School Street","","Clinton","MA","01510","Alex Chiu","781-338-3586","alexandria.w.chiu@mass.gov",null,216,2130310,14,"Yes",null,1813,258]
[77,"04380000","Codman Academy Charter Public (District)","Charter District","Charter School Leader","Thabiti Brown","637 Washington Street","","Dorchester","MA","02124","Julia Foodman","781-338-3577","julia.b.foodman@mass.gov",null,23,2016415,18,"Yes",null,328,34]
[78,"00650000","Cohasset","Public School District","Superintendent","Patrick Sullivan","143 Pond Street","","Cohasset","MA","02025","Ellie Rounds-Bloom","781-338-3128","eleanor.rounds@mass.gov",null,4,390890,0,"Yes",null,1426,1]
[79,"35030000","Collegiate Charter School of Lowell (District)","Charter District","Charter School Leader","Laurie Hodgdon","1857 Middlesex Street","","Lowell","MA","01851","Sue Mazzarella","781-338-3587","susan.mazzarella@mass.gov",null,220,2270750,0,"Yes",null,1018,262]
[80,"04360000","Community Charter School of Cambridge (District)","Charter District","Charter School Leader","Rebecca Norris","245 Bent Street","","Cambridge","MA","02141","Nancy Labrie","781-338-3536","nancy.h.labrie@mass.gov",null,13,665926,4,"No",null,306,18]
[81,"04260000","Community Day Charter Public School - Gateway (District)","Charter District","Charter School Leader","Mary Chance","190 Hampshire Street","","Lawrence","MA","01840","Colleen Holforty","781-338-3522","colleen.e.holforty@mass.gov",null,74,1222242,0,"Yes",null,366,77]
[82,"04400000","Community Day Charter Public School - Prospect (District)","Charter District","Charter School Leader","Mary Chance","190 Hampshire Street","","Lawrence","MA","01840","Colleen Holforty","781-338-3522","colleen.e.holforty@mass.gov",null,121,1116832,0,"No",null,368,96]
[83,"04310000","Community Day Charter Public School - R. Kingman Webster (District)","Charter District","Charter School Leader","Mary Chance","190 Hampshire Street","","Lawrence","MA","01840","Colleen Holforty","781-338-3522","colleen.e.holforty@mass.gov",null,80,1139810,0,"No",null,367,82]
[84,"00670000","Concord","Public School District","Superintendent","Laurie Hunter","120 Meriam Rd","","Concord","MA","01742","Nancy Labrie","781-338-3536","nancy.h.labrie@mass.gov",null,55,995840,1,"Yes",null,1982,43]
[85,"06400000","Concord-Carlisle","Public School District","Superintendent","Laurie Hunter","120 Meriam Rd","","Concord","MA","01742","Nancy Labrie","781-338-3536","nancy.h.labrie@mass.gov",null,6,193025,0,"Yes",null,1332,4]
[86,"04390000","Conservatory Lab Charter (District)","Charter District","Charter School Leader","John Chistolini","2120 Dorchester Avenue","","Dorchester","MA","02124","Alex Chiu","781-338-3586","alexandria.w.chiu@mass.gov",null,72,2402137,4,"No",null,402,68]
[87,"00680000","Conway","Public School District","Superintendent","Darius Modestow","113 North Main Street, Office C101","","South Deerfield","MA","01373","Alex Lilley","781-338-6212","alex.j.lilley@mass.gov",null,null,177018,1,null,null,118,0]
[88,"00710000","Danvers","Public School District","Superintendent","Lisa Dana","64 Cabot Road","","Danvers","MA","01923","Sue Mazzarella","781-338-3587","susan.mazzarella@mass.gov",null,38,2406611,38,"Yes",null,3245,41]
[89,"00720000","Dartmouth","Public School District","Superintendent","Bonny Gifford","8 Bush Street","","Dartmouth","MA","02748","Sue Mazzarella","781-338-3587","susan.mazzarella@mass.gov",null,94,2945298,1,"Yes",null,3355,54]
[90,"00730000","Dedham","Public School District","Superintendent","Michael Welch","100 Whiting Avenue","","Dedham","MA","02026","Beth O'Connell","781-338-3132","elizabeth.a.o'connell@mass.gov",null,179,2339292,43,"Yes",null,2492,131]
[91,"00740000","Deerfield","Public School District","Superintendent","Darius Modestow","113 North Main Street, Office C101","","South Deerfield","MA","01373","Alex Lilley","781-338-6212","alex.j.lilley@mass.gov",null,4,262306,2,"No",null,307,6]
[92,"06450000","Dennis-Yarmouth","Public School District","Superintendent","Carol Woodbury","296 Station Avenue","","South Yarmouth","MA","02664","Sue Mazzarella","781-338-3587","susan.mazzarella@mass.gov",null,288,5082242,66,"Yes",null,2708,301]
[93,"06500000","Dighton-Rehoboth","Public School District","Superintendent","Anthony Azar","2700 Regional Road","","North Dighton","MA","02764","Alex Chiu","781-338-3586","alexandria.w.chiu@mass.gov",null,10,1861479,6,"Yes",null,2574,12]
[94,"00770000","Douglas","Public School District","Superintendent","Kevin Maines","21 Davis Street","","Douglas","MA","01516","Alex Lilley","781-338-6212","alex.j.lilley@mass.gov",null,9,406843,0,"Yes",null,1145,8]
[95,"00780000","Dover","Public School District","Superintendent","Andrew Keough","157 Farm Street","","Dover","MA","02030","Beth O'Connell","781-338-3132","elizabeth.a.o'connell@mass.gov",null,16,170448,0,"Yes",null,476,9]
[96,"06550000","Dover-Sherborn","Public School District","Superintendent","Andrew Keough","157 Farm Street","","Dover","MA","02030","Beth O'Connell","781-338-3132","elizabeth.a.o'connell@mass.gov",null,4,313761,0,"Yes",null,1204,3]
[97,"00790000","Dracut","Public School District","Superintendent","Steven Stone","2063 Lakeview Avenue","","Dracut","MA","01826","Colleen Holforty","781-338-3522","colleen.e.holforty@mass.gov",null,65,3421773,26,"Yes",null,3652,69]
[98,"04070000","Dudley Street Neighborhood Charter School (District)","Charter District","Charter School Leader","Alexandra Soto","6 Shirley Street","","Boston","MA","02119","Beth O'Connell","781-338-3132","elizabeth.a.o'connell@mass.gov",null,68,1553892,0,"No",null,235,76]
[99,"06580000","Dudley-Charlton Reg","Public School District","Superintendent","Steven Lamarche","68 Dudley Oxford Road","","Dudley","MA","01571","Sue Mazzarella","781-338-3587","susan.mazzarella@mass.gov",null,94,2519086,31,"Yes",null,3363,106]
[100,"00820000","Duxbury","Public School District","Superintendent","John Antonucci","93 Chandler Street","","Duxbury","MA","02332","Nancy Labrie","781-338-3536","nancy.h.labrie@mass.gov",null,9,465598,7,"Yes",null,2773,9]
[101,"00830000","East Bridgewater","Public School District","Superintendent","Elizabeth Legault","143 Plymouth Street","","East Bridgewater","MA","02333","Russ Fleming","781-338-6259","russellw.fleming@mass.gov",null,20,1297405,9,"Yes",null,2021,26]
[102,"00870000","East Longmeadow","Public School District","Superintendent","Gordon Smith","180 Maple Street","","East Longmeadow","MA","01028","Russ Fleming","781-338-6259","russellw.fleming@mass.gov",null,51,2230447,5,"Yes",null,2407,37]
[103,"00850000","Eastham","Public School District","Superintendent","Thomas Conrad","78 Eldredge Pkwy","","Orleans","MA","02653","Julia Foodman","781-338-3577","julia.b.foodman@mass.gov",null,5,336071,1,"Yes",null,170,13]
[104,"00860000","Easthampton","Public School District","Superintendent","Allison Leclair","50 Payson Avenue","Second Floor","Easthampton","MA","01027","Beth O'Connell","781-338-3132","elizabeth.a.o'connell@mass.gov",null,41,1615282,10,"Yes",null,1409,44]
[105,"00880000","Easton","Public School District","Superintendent","Lisha Cabral","50 Oliver Street","","North Easton","MA","02356","Alex Lilley","781-338-6212","alex.j.lilley@mass.gov",null,65,1081867,18,"Yes",null,3379,53]
[106,"00890000","Edgartown","Public School District","Superintendent","Matthew D'Andrea","4 Pine Street","","Vineyard Haven","MA","02568","Sue Mazzarella","781-338-3587","susan.mazzarella@mass.gov",null,81,226901,0,"No",null,374,80]
[107,"04520000","Edward M. Kennedy Academy for Health Careers (Horace Mann Charter) (District)","Charter District","Charter School Leader","Caren Walker Gregory","360 Huntington Avenue","c/o 102 Cahners Hall","Boston","MA","02115","Sue Mazzarella","781-338-3587","susan.mazzarella@mass.gov",null,63,2345260,18,"Yes",null,396,51]
[108,"00910000","Erving","Public School District","Superintendent","Jennifer Culkeen","18 Pleasant Street","","Erving","MA","01344","Nancy Labrie","781-338-3536","nancy.h.labrie@mass.gov",null,2,207643,2,"No",null,102,0]
[109,"08170000","Essex North Shore Agricultural and Technical School District","Public School District","Superintendent","Heidi Riccio","565 Maple Street","P.O. Box 346","Hathorne","MA","01937","Alex Chiu","781-338-3586","alexandria.w.chiu@mass.gov",null,2,1222361,9,"Yes",null,1559,5]
[110,"00930000","Everett","Public School District","Superintendent","Priya Tahiliani","121 Vine Street","","Everett","MA","02149","Ellie Rounds-Bloom","781-338-3128","eleanor.rounds@mass.gov",null,1669,13453831,84,"Yes",null,6649,1851]
[111,"04100000","Excel Academy Charter (District)","Charter District","Charter School Leader","Owen Stearns","58 Moore Street","","East Boston","MA","02128","Alex Chiu","781-338-3586","alexandria.w.chiu@mass.gov",null,152,4613775,6,"Yes",null,1398,125]
[112,"00940000","Fairhaven","Public School District","Superintendent","Robert Baldwin","128 Washington Street","","Fairhaven","MA","02719","Alex Chiu","781-338-3586","alexandria.w.chiu@mass.gov",null,33,2639374,13,"Yes",null,1880,20]
[113,"00950000","Fall River","Public School District","Superintendent","Matthew Malone","417 Rock Street","","Fall River","MA","02720","Sue Mazzarella","781-338-3587","susan.mazzarella@mass.gov",null,1714,39152523,558,"Yes",null,9884,1751]
[114,"00960000","Falmouth","Public School District","Superintendent","Lori Duerr","340 Teaticket Hwy","","East Falmouth","MA","02536","Beth O'Connell","781-338-3132","elizabeth.a.o'connell@mass.gov",null,110,3480931,14,"Yes",null,2938,118]
[115,"06620000","Farmington River Reg","Public School District","Superintendent","Thomas Nadolny","555 N Main Street","PO Box 679","Otis","MA","01253","Ellie Rounds-Bloom","781-338-3128","eleanor.rounds@mass.gov",null,0,233229,0,"No",null,92,0]
[116,"00970000","Fitchburg","Public School District","Superintendent","Robert Jokela","376 South Street","","Fitchburg","MA","01420","Russ Fleming","781-338-6259","russellw.fleming@mass.gov",null,843,16664400,222,"Yes",null,5146,843]
[117,"00980000","Florida","Public School District","Superintendent","John Franzoni","56 North County Rd","","Florida","MA","01247","Sue Mazzarella","781-338-3587","susan.mazzarella@mass.gov",null,0,177017,0,"Yes",null,84,0]
[118,"04130000","Four Rivers Charter Public (District)","Charter District","Charter School Leader","Peter Garbus","248 Colrain Road","","Greenfield","MA","01301","Sue Mazzarella","781-338-3587","susan.mazzarella@mass.gov",null,0,254030,0,"No",null,216,0]
[119,"00990000","Foxborough","Public School District","Superintendent","Amy Berdos","60 South Street","C/O Igo Administration Building","Foxborough","MA","02035","Ellie Rounds-Bloom","781-338-3128","eleanor.rounds@mass.gov",null,66,750188,14,"Yes",null,2405,63]
[120,"04460000","Foxborough Regional Charter (District)","Charter District","Charter School Leader","Mark Logan","131 Central Street","35 Commercial Street","Foxborough","MA","02035","Nancy Labrie","781-338-3536","nancy.h.labrie@mass.gov",null,147,1448212,13,"No",null,1688,125]
[121,"01000000","Framingham","Public School District","Superintendent","Robert Tremblay","73 Mt. Wayte Avenue","Suite 5","Framingham","MA","01702","Colleen Holforty","781-338-3522","colleen.e.holforty@mass.gov",null,2001,14406743,574,"Yes",null,8632,2296]
[122,"04780000","Francis W. Parker Charter Essential (District)","Charter District","Charter School Leader","Todd Sumner","49 Antietam Street","","Devens","MA","01434","Julia Foodman","781-338-3577","julia.b.foodman@mass.gov",null,null,177018,0,null,null,393,0]
[123,"01010000","Franklin","Public School District","Superintendent","Sara Ahern","355 East Central Street","","Franklin","MA","02038","Nancy Labrie","781-338-3536","nancy.h.labrie@mass.gov",null,78,1046173,7,"Yes",null,4783,72]
[124,"08180000","Franklin County Regional Vocational Technical","Public School District","Superintendent","Richard Martin","82 Industrial Blvd","","Turners Falls","MA","01376","Sue Mazzarella","781-338-3587","susan.mazzarella@mass.gov",null,0,845824,11,"No",null,542,1]
[125,"06650000","Freetown-Lakeville","Public School District","Superintendent","Richard Medeiros","98 Howland Rd","","Lakeville","MA","02347","Colleen Holforty","781-338-3522","colleen.e.holforty@mass.gov",null,18,2218998,5,"Yes",null,2701,16]
[126,"06700000","Frontier","Public School District","Superintendent","Darius Modestow","113 North Main Street, Office C101","","South Deerfield","MA","01373","Alex Lilley","781-338-6212","alex.j.lilley@mass.gov",null,7,344372,4,"Yes",null,653,4]
[127,"01030000","Gardner","Public School District","Superintendent","Mark Pellegrino","70 Waterford Street","","Gardner","MA","01440","Russ Fleming","781-338-6259","russellw.fleming@mass.gov",null,100,5966598,33,"Yes",null,2143,124]
[128,"06720000","Gateway","Public School District","Superintendent","David Hopson","12 Littleville Road","","Huntington","MA","01050","Russ Fleming","781-338-6259","russellw.fleming@mass.gov",null,18,1264891,5,"Yes",null,729,17]
[129,"01050000","Georgetown","Public School District","Superintendent","Carol Jacobs","51 North Street","","Georgetown","MA","01833","Julia Foodman","781-338-3577","julia.b.foodman@mass.gov",null,3,321826,0,"Yes",null,1219,0]
[130,"06740000","Gill-Montague","Public School District","Superintendent","Michael Sullivan","35 Crocker Avenue","","Turners Falls","MA","01376","Beth O'Connell","781-338-3132","elizabeth.a.o'connell@mass.gov",null,52,1925398,21,"Yes",null,813,55]
[131,"04960000","Global Learning Charter Public (District)","Charter District","Charter School Leader","Stephen Furtado","190 Ashley Boulevard","","New Bedford","MA","02746","Julia Foodman","781-338-3577","julia.b.foodman@mass.gov",null,52,1563958,2,"Yes",null,501,45]
[132,"01070000","Gloucester","Public School District","Superintendent","Richard Safier","2 Blackburn Drive","","Gloucester","MA","01930","Beth O'Connell","781-338-3132","elizabeth.a.o'connell@mass.gov",null,185,4417611,10,"Yes",null,2716,213]
[133,"01090000","Gosnold","Public School District","Superintendent","Margaret Frieswyk","263 Hill & Plain Road",null,"East Falmouth","MA","02536","Ellie Rounds-Bloom","781-338-3128","eleanor.rounds@mass.gov",null,null,170448,0,null,null,8,0]
[134,"01100000","Grafton","Public School District","Superintendent","James Cummings","30 Providence Rd","","Grafton","MA","01519","Alex Lilley","781-338-6212","alex.j.lilley@mass.gov",null,52,592611,4,"Yes",null,3041,63]
[135,"01110000","Granby","Public School District","Superintendent","Sheryl Stanton","387 East State Street","","Granby","MA","01033","Ellie Rounds-Bloom","781-338-3128","eleanor.rounds@mass.gov",null,31,658923,2,"Yes",null,689,32]
[136,"08210000","Greater Fall River Regional Vocational Technical","Public School District","Superintendent","Elvio Ferreira","251 Stonehaven Rd","","Fall River","MA","02723","Alex Chiu","781-338-3586","alexandria.w.chiu@mass.gov",null,21,2930755,3,"Yes",null,1440,25]
[137,"08230000","Greater Lawrence Regional Vocational Technical","Public School District","Superintendent","John Lavoie","57 River Rd","","Andover","MA","01810","Ellie Rounds-Bloom","781-338-3128","eleanor.rounds@mass.gov",null,202,4961627,18,"No",null,1626,156]
[138,"08280000","Greater Lowell Regional Vocational Technical","Public School District","Superintendent","Jill Davis","250 Pawtucket Blvd","","Tyngsborough","MA","01879","Alex Chiu","781-338-3586","alexandria.w.chiu@mass.gov",null,164,5010267,3,"Yes",null,2258,219]
[139,"08250000","Greater New Bedford Regional Vocational Technical","Public School District","Superintendent","James O'Brien","1121 Ashley Blvd","","New Bedford","MA","02745","Colleen Holforty","781-338-3522","colleen.e.holforty@mass.gov",null,71,4582660,16,"No",null,2083,86]
[140,"01140000","Greenfield","Public School District","Superintendent","Jordana Harper","195 Federal Street, Suite 100","","Greenfield","MA","01301","Alex Lilley","781-338-6212","alex.j.lilley@mass.gov",null,99,4095336,50,"Yes",null,1505,81]
[141,"39010000","Greenfield Commonwealth Virtual District","Public School District","Superintendent","Salah Khelfaoui","238 Main St.","3rd Floor","Greenfield","MA","01301","Nancy Labrie","781-338-3536","nancy.h.labrie@mass.gov",null,12,2204001,15,"No",null,1043,24]
[142,"06730000","Groton-Dunstable","Public School District","Superintendent","Laura Chesson","344 Main Street","","Groton","MA","01450","Alex Chiu","781-338-3586","alexandria.w.chiu@mass.gov",null,25,344420,2,"Yes",null,2222,23]
[143,"01170000","Hadley","Public School District","Superintendent","Anne McKenzie","125 Russell Street","","Hadley","MA","01035","Nancy Labrie","781-338-3536","nancy.h.labrie@mass.gov",null,31,436236,8,"Yes",null,493,21]
[144,"01180000","Halifax","Public School District","Superintendent","Jill Proulx","250 Pembroke Street","","Kingston","MA","02364","Nancy Labrie","781-338-3536","nancy.h.labrie@mass.gov",null,7,225725,1,"Yes",null,581,7]
[145,"06750000","Hamilton-Wenham","Public School District","Superintendent","Julie Kukenberger","5 School Street","","Wenham","MA","01984","Sue Mazzarella","781-338-3587","susan.mazzarella@mass.gov",null,11,651903,5,"Yes",null,1674,12]
[146,"04990000","Hampden Charter School of Science East (District)","Charter District","Charter School Leader","Tarkan Topcuoglu","20 Johnson Road","","Chicopee","MA","01022","Beth O'Connell","781-338-3132","elizabeth.a.o'connell@mass.gov",null,17,2002833,0,"Yes",null,536,32]
[147,"35160000","Hampden Charter School of Science West (District)","Charter District","Charter School Leader","Tarkan Topcuoglu","511 Main St.","","West Springfield","MA","01089","Beth O'Connell","781-338-3132","elizabeth.a.o'connell@mass.gov",null,26,1528821,0,"Yes",null,321,24]
[148,"06800000","Hampden-Wilbraham","Public School District","Superintendent","Albert Ganem","621 Main Street","","Wilbraham","MA","01095","Alex Lilley","781-338-6212","alex.j.lilley@mass.gov",null,25,2263271,5,"Yes",null,2788,36]
[149,"06830000","Hampshire","Public School District","Superintendent","Aaron Osborne","19 Stage Rd","","Westhampton","MA","01027","Nancy Labrie","781-338-3536","nancy.h.labrie@mass.gov",null,11,177017,3,"Yes",null,689,13]
[150,"01210000","Hancock","Public School District","Superintendent","Peter Dillon","1831 STATE ROAD","","RICHMOND","MA","01254","Julia Foodman","781-338-3577","julia.b.foodman@mass.gov",null,null,170448,0,null,null,47,0]
[151,"01220000","Hanover","Public School District","Superintendent","Matthew Ferron","188 Broadway Street","","Hanover","MA","02339","Beth O'Connell","781-338-3132","elizabeth.a.o'connell@mass.gov",null,24,425129,0,"Yes",null,2580,24]
[152,"01250000","Harvard","Public School District","Superintendent","Linda Dwight","39 Massachusetts Avenue","","Harvard","MA","01451","Sue Mazzarella","781-338-3587","susan.mazzarella@mass.gov",null,17,488342,26,"Yes",null,1003,9]
[153,"01270000","Hatfield","Public School District","Superintendent","John Robert","34 School Street","","Hatfield","MA","01038","Alex Lilley","781-338-6212","alex.j.lilley@mass.gov",null,0,226990,0,"Yes",null,385,1]
[154,"01280000","Haverhill","Public School District","Superintendent","Margaret Marotta","4 Summer Street","","Haverhill","MA","01830","Ellie Rounds-Bloom","781-338-3128","eleanor.rounds@mass.gov",null,771,17167041,294,"Yes",null,7663,758]
[155,"06850000","Hawlemont","Public School District","Superintendent","Patricia Bell","24 Ashfield Rd","","Shelburne Falls","MA","01370","Alex Lilley","781-338-6212","alex.j.lilley@mass.gov",null,0,238007,0,"No",null,105,5]
[156,"04190000","Helen Y. Davis Leadership Academy Charter Public (District)","Charter District","Charter School Leader","Chris Coblyn","23 Leonard Street","","Boston","MA","02122","Alex Lilley","781-338-6212","alex.j.lilley@mass.gov",null,16,1630351,5,"Yes",null,187,9]
[157,"04550000","Hill View Montessori Charter Public (District)","Charter District","Charter School Leader","Phil Arnold","75 Foundation Ave","Ward Hill Business Park","Haverhill","MA","01835","Ellie Rounds-Bloom","781-338-3128","eleanor.rounds@mass.gov",null,33,263839,0,"Yes",null,305,18]
[158,"04500000","Hilltown Cooperative Charter Public (District)","Charter District","Charter School Leader","Daniel Klatz","1 Industrial Parkway","","Easthampton","MA","01039","Beth O'Connell","781-338-3132","elizabeth.a.o'connell@mass.gov",null,0,177017,0,"No",null,218,0]
[159,"01310000","Hingham","Public School District","Superintendent","Paul Austin","220 Central Street","","Hingham","MA","02043","Ellie Rounds-Bloom","781-338-3128","eleanor.rounds@mass.gov",null,15,944059,4,"Yes",null,3872,16]
[160,"01330000","Holbrook","Public School District","Superintendent","Julie Hamilton","245 So. Franklin Street","","Holbrook","MA","02343","Nancy Labrie","781-338-3536","nancy.h.labrie@mass.gov",null,95,1604903,10,"Yes",null,1236,73]
[161,"01350000","Holland","Public School District","Superintendent","Erin Nosek","320 Brookfield Rd","","Fiskdale","MA","01518","Russ Fleming","781-338-6259","russellw.fleming@mass.gov",null,0,230065,4,"Yes",null,190,0]
[162,"01360000","Holliston","Public School District","Superintendent","Bradford Jackson","370 Hollis Street","","Holliston","MA","01746","Julia Foodman","781-338-3577","julia.b.foodman@mass.gov",null,67,437615,1,"No",null,2716,64]
[163,"01370000","Holyoke","Public School District","Superintendent","Stephen Zrike","57 Suffolk Street","","Holyoke","MA","01040","Alex Lilley","781-338-6212","alex.j.lilley@mass.gov",null,1161,37135160,520,"Yes",null,5037,1045]
[164,"04530000","Holyoke Community Charter (District)","Charter District","Charter School Leader","Sonia Pope","2200 Northampton Street","","Holyoke","MA","01040","Alex Lilley","781-338-6212","alex.j.lilley@mass.gov",null,107,4574239,6,"No",null,701,88]
[165,"06030000","Hoosac Valley Regional","Public School District","Superintendent","Aaron Dean","191 Church St",null,"Cheshire","MA","01225","Alex Lilley","781-338-6212","alex.j.lilley@mass.gov",null,8,2267932,15,"Yes",null,978,10]
[166,"01380000","Hopedale","Public School District","Superintendent","Karen Crebase","25 Adin Street","","Hopedale","MA","01747","Sue Mazzarella","781-338-3587","susan.mazzarella@mass.gov",null,20,581261,1,"No",null,1034,43]
[167,"01390000","Hopkinton","Public School District","Superintendent","Carol Cavanaugh","89 Hayden Rowe Street","","Hopkinton","MA","01748","Alex Lilley","781-338-6212","alex.j.lilley@mass.gov",null,193,452471,12,"Yes",null,3883,257]
[168,"01410000","Hudson","Public School District","Superintendent","Marco Rodrigues","155 Apsley Street","","Hudson","MA","01749","Ellie Rounds-Bloom","781-338-3128","eleanor.rounds@mass.gov",null,242,2265039,23,"Yes",null,2392,298]
[169,"01420000","Hull","Public School District","Superintendent","Michael Devine","18 Harborview Road","","Hull","MA","02045","Alex Chiu","781-338-3586","alexandria.w.chiu@mass.gov",null,3,962051,3,"Yes",null,773,7]
[170,"04350000","Innovation Academy Charter (District)","Charter District","Charter School Leader","Gregory Orpen","72 Tyng Road","","Tyngsborough","MA","01879","Colleen Holforty","781-338-3522","colleen.e.holforty@mass.gov",null,14,467766,0,"No",null,783,19]
[171,"01440000","Ipswich","Public School District","Superintendent","Brian Blake","1 Lord Square","","Ipswich","MA","01938","Nancy Labrie","781-338-3536","nancy.h.labrie@mass.gov",null,34,1219470,12,"Yes",null,1590,27]
[172,"06900000","King Philip","Public School District","Superintendent","Paul Zinni","18 King Street","","Norfolk","MA","02056","Nancy Labrie","781-338-3536","nancy.h.labrie@mass.gov",null,13,363164,3,"Yes",null,1971,4]
[173,"01450000","Kingston","Public School District","Superintendent","Jill Proulx","250 Pembroke Street","","Kingston","MA","02364","Nancy Labrie","781-338-3536","nancy.h.labrie@mass.gov",null,23,323458,16,"Yes",null,1044,29]
[174,"04630000","KIPP Academy Boston Charter School (District)","Charter District","Charter School Leader","Caleb Dolan","37 Babson Street","KIPP Academy Boston","Mattapan","MA","02126","Beth O'Connell","781-338-3132","elizabeth.a.o'connell@mass.gov",null,167,4209446,22,"No",null,623,105]
[175,"04290000","KIPP Academy Lynn Charter (District)","Charter District","Charter School Leader","Caleb Dolan","90 High Rock Street","","Lynn","MA","01902","Beth O'Connell","781-338-3132","elizabeth.a.o'connell@mass.gov",null,274,3881555,10,"Yes",null,1611,196]
[176,"01490000","Lawrence","Public School District","Superintendent","Cynthia Paris","237 Essex Street","","Lawrence","MA","01840","Russ Fleming","781-338-6259","russellw.fleming@mass.gov",null,4764,54108599,242,"Yes",null,12860,4552]
[177,"04540000","Lawrence Family Development Charter (District)","Charter District","Charter School Leader","Ralph Carrero","34 West Street","","Lawrence","MA","01841","Ellie Rounds-Bloom","781-338-3128","eleanor.rounds@mass.gov",null,166,2393131,0,"No",null,720,146]
[178,"04860000","Learning First Charter Public School(District)","Charter District","Charter School Leader","Leo Flanagan","51 Gage Street","","Worcester","MA","01605","Julia Foodman","781-338-3577","julia.b.foodman@mass.gov",null,35,2297758,5,"Yes",null,670,173]
[179,"01500000","Lee","Public School District","Superintendent","Michael Richard","300A Greylock St","","Lee","MA","01238","Sue Mazzarella","781-338-3587","susan.mazzarella@mass.gov",null,41,756930,17,"Yes",null,656,28]
[180,"01510000","Leicester","Public School District","Superintendent","Marilyn Tencza","3 Washburn Square","3rd Floor","Leicester","MA","01524","Colleen Holforty","781-338-3522","colleen.e.holforty@mass.gov",null,18,1718957,11,"Yes",null,1356,55]
[181,"01520000","Lenox","Public School District","Superintendent","William Cameron","6 Walker Street","","Lenox","MA","01240","Ellie Rounds-Bloom","781-338-3128","eleanor.rounds@mass.gov",null,701,893432,0,"Yes",null,724,20]
[182,"01540000","Leverett","Public School District","Superintendent","Jennifer Culkeen","18 Pleasant Street","","Erving","MA","01344","Nancy Labrie","781-338-3536","nancy.h.labrie@mass.gov",null,null,177018,1,null,null,113,0]
[183,"01530000","Leominster","Public School District","Superintendent","Paula Deacon","24 Church Street","","Leominster","MA","01453","Colleen Holforty","781-338-3522","colleen.e.holforty@mass.gov",null,628,11193495,405,"Yes",null,5858,748]
[184,"01550000","Lexington","Public School District","Superintendent","Julie Hackett","146 Maple Street","","Lexington","MA","02420","Russ Fleming","781-338-6259","russellw.fleming@mass.gov",null,76,1202445,9,"Yes",null,6932,540]
[185,"35140000","Libertas Academy Charter School (District)","Charter District","Charter School Leader","Modesto Montero","146 Chestnut Street","","Springfield","MA","01103","Ellie Rounds-Bloom","781-338-3128","eleanor.rounds@mass.gov",null,57,1883670,0,"Yes",null,260,86]
[186,"01570000","Lincoln","Public School District","Superintendent","Rebecca McFall","1 Ballfield Road","","Lincoln","MA","01773","Julia Foodman","781-338-3577","julia.b.foodman@mass.gov",null,10,170448,1,"Yes",null,1001,43]
[187,"06950000","Lincoln-Sudbury","Public School District","Superintendent","Bella Wong","390 Lincoln Rd","","Sudbury","MA","01776","Russ Fleming","781-338-6259","russellw.fleming@mass.gov",null,30,385593,4,"Yes",null,1551,12]
[188,"01580000","Littleton","Public School District","Superintendent","Kelly Clenchy","PO Box 1486","","Littleton","MA","01460","Beth O'Connell","781-338-3132","elizabeth.a.o'connell@mass.gov",null,26,357471,3,"Yes",null,1540,27]
[189,"01590000","Longmeadow","Public School District","Superintendent","Maurice O'shea","535 Bliss Road","","Longmeadow","MA","01106","Sue Mazzarella","781-338-3587","susan.mazzarella@mass.gov",null,3518,1098907,2,"Yes",null,2729,16]
[190,"01600000","Lowell","Public School District","Superintendent","Joel Boyd","155 Merrimack Street","","Lowell","MA","01852","Nancy Labrie","781-338-3536","nancy.h.labrie@mass.gov",null,391,40167351,1312,"Yes",null,13595,3354]
[191,"04560000","Lowell Community Charter Public (District)","Charter District","Charter School Leader","Nicholas Leonardos","206 Jackson Street","","Lowell","MA","01852","Nancy Labrie","781-338-3536","nancy.h.labrie@mass.gov",null,8,2062058,24,"No",null,764,415]
[192,"04580000","Lowell Middlesex Academy Charter (District)","Charter District","Charter School Leader","Margaret McDevitt","67 Middle St","","Lowell","MA","01852","Russ Fleming","781-338-6259","russellw.fleming@mass.gov",null,65,325592,0,"Yes",null,86,4]
[193,"01610000","Ludlow","Public School District","Superintendent","Todd Gazda","63 Chestnut Street","","Ludlow","MA","01056","Alex Chiu","781-338-3586","alexandria.w.chiu@mass.gov",null,24,3192883,9,"Yes",null,2351,91]
[194,"01620000","Lunenburg","Public School District","Superintendent","Kathleen Burnham","1025 Mass Avenue","","Lunenburg","MA","01462","Colleen Holforty","781-338-3522","colleen.e.holforty@mass.gov",null,4063,1351034,8,"Yes",null,1544,18]
[195,"01630000","Lynn","Public School District","Superintendent","Patrick Tutwiler","100 Bennett St","","Lynn","MA","01905","Colleen Holforty","781-338-3522","colleen.e.holforty@mass.gov",null,47,42106523,1003,"Yes",null,15469,4879]
[196,"01640000","Lynnfield","Public School District","Superintendent","Jane Tremblay","525 Salem Street","","Lynnfield","MA","01940","Russ Fleming","781-338-6259","russellw.fleming@mass.gov",null,1351,428254,0,"Yes",null,2156,52]
[197,"01650000","Malden","Public School District","Superintendent","John Oteri","77 Salem Street","","Malden","MA","02148","Julia Foodman","781-338-3577","julia.b.foodman@mass.gov",null,8,15825956,139,"Yes",null,5887,1148]
[198,"06980000","Manchester Essex Regional","Public School District","Superintendent","Pamela Beaudoin","PO BOX 1407","","Manchester","MA","01944","Julia Foodman","781-338-3577","julia.b.foodman@mass.gov",null,74,442591,2,"Yes",null,1241,8]
[199,"01670000","Mansfield","Public School District","Superintendent","Teresa Murphy","2 Park Row","","Mansfield","MA","02048","Beth O'Connell","781-338-3132","elizabeth.a.o'connell@mass.gov",null,0,1182884,27,"No",null,3429,64]
[200,"35170000","Map Academy Charter School (District)","Charter District","Charter School Leader","Rachel Babcock","11 Resnik Road","","Plymouth","MA","02360","Beth O'Connell","781-338-3132","elizabeth.a.o'connell@mass.gov",null,113,427144,23,"Yes",null,197,0]
[201,"01680000","Marblehead","Public School District","Superintendent","William McAlduff Jr","9 Widger Road","","Marblehead","MA","01945","Sue Mazzarella","781-338-3587","susan.mazzarella@mass.gov",null,3,796636,12,"Yes",null,2670,112]
[202,"04640000","Marblehead Community Charter Public (District)","Charter District","Charter School Leader","Peter Cohen","17 Lime Street","","Marblehead","MA","01945","Beth O'Connell","781-338-3132","elizabeth.a.o'connell@mass.gov",null,1,170448,2,"Yes",null,212,17]
[203,"01690000","Marion","Public School District","Superintendent","Douglas White","135 Marion Rd","","Mattapoisett","MA","02739","Colleen Holforty","781-338-3522","colleen.e.holforty@mass.gov",null,1087,305450,1,"Yes",null,388,1]
[204,"01700000","Marlborough","Public School District","Superintendent","Michael Bergeron","17 Washington Street","","Marlborough","MA","01752","Ellie Rounds-Bloom","781-338-3128","eleanor.rounds@mass.gov",null,41,6329126,52,"Yes",null,4513,1079]
[205,"01710000","Marshfield","Public School District","Superintendent","Jeffrey Granatino","76 South River Street","","Marshfield","MA","02050","Colleen Holforty","781-338-3522","colleen.e.holforty@mass.gov",null,52,2782156,69,"Yes",null,3709,49]
[206,"07000000","Martha's Vineyard","Public School District","Superintendent","Matthew D'Andrea","4 Pine Street","","Vineyard Haven","MA","02568","Sue Mazzarella","781-338-3587","susan.mazzarella@mass.gov",null,7,250197,2,"No",null,694,81]
[207,"04660000","Martha's Vineyard Charter (District)","Charter District","Charter School Leader","Peter Steedman","PO Box 1150","","West Tisbury","MA","02575","Sue Mazzarella","781-338-3587","susan.mazzarella@mass.gov",null,99,373613,3,"Yes",null,168,10]
[208,"04920000","Martin Luther King Jr. Charter School of Excellence (District)","Charter District","Charter School Leader","Kendra Salvador","285 Dorset Street","","Springfield","MA","01108","Colleen Holforty","781-338-3522","colleen.e.holforty@mass.gov",null,9,2720097,4,"Yes",null,359,98]
[209,"07050000","Masconomet","Public School District","Superintendent","Michael Harvey","20 Endicott Rd","","Boxford","MA","01921","Sue Mazzarella","781-338-3587","susan.mazzarella@mass.gov",null,46,1351378,1,"Yes",null,1721,2]
[210,"01720000","Mashpee","Public School District","Superintendent","Patricia DeBoer","150-A Old Barnstable Road","","Mashpee","MA","02649","Nancy Labrie","781-338-3536","nancy.h.labrie@mass.gov",null,299,1494801,26,"No",null,1420,60]
[211,"04690000","MATCH Charter Public School (District)","Charter District","Charter School Leader","Nnenna Ude","1001 Commonwealth Avenue","","Boston","MA","02215","Ellie Rounds-Bloom","781-338-3128","eleanor.rounds@mass.gov",null,3,7211392,2,"Yes",null,1164,181]
[212,"01730000","Mattapoisett","Public School District","Superintendent","Douglas White","135 Marion Rd","","Mattapoisett","MA","02739","Colleen Holforty","781-338-3522","colleen.e.holforty@mass.gov",null,56,255829,2,"Yes",null,390,2]
[213,"01740000","Maynard","Public School District","Superintendent","Mary Jane Rickson","3-R Tiger Drive","","Maynard","MA","01754","Julia Foodman","781-338-3577","julia.b.foodman@mass.gov",null,442,1155012,6,"Yes",null,1145,48]
[214,"01750000","Medfield","Public School District","Superintendent","Jeffrey Marsden","459 Main St","3rd Fl","Medfield","MA","02052","Beth O'Connell","781-338-3132","elizabeth.a.o'connell@mass.gov",null,null,373649,5,null,null,2471,22]
[215,"01760000","Medford","Public School District","Superintendent","Marice Edouard-Vincent","489 Winthrop Street","","Medford","MA","02155","Sue Mazzarella","781-338-3587","susan.mazzarella@mass.gov",null,29,5309620,50,"No",null,3887,418]
[216,"01770000","Medway","Public School District","Superintendent","Armand Pires","45 Holliston Street","","Medway","MA","02053","Alex Lilley","781-338-6212","alex.j.lilley@mass.gov",null,189,594129,4,"Yes",null,2083,34]
[217,"01780000","Melrose","Public School District","Superintendent","Cyndy Taymore","360 Lynn Fells Pkwy","","Melrose","MA","02176","Ellie Rounds-Bloom","781-338-3128","eleanor.rounds@mass.gov",null,32,1001426,25,"Yes",null,3576,203]
[218,"07100000","Mendon-Upton","Public School District","Superintendent","Joseph Maruszczak","150 North Ave","","Mendon","MA","01756","Alex Lilley","781-338-6212","alex.j.lilley@mass.gov",null,679,468915,1,"Yes",null,2118,50]
[219,"01810000","Methuen","Public School District","Superintendent","Brandi Kwong","10 Ditson Place","","Methuen","MA","01844","Colleen Holforty","781-338-3522","colleen.e.holforty@mass.gov",null,28,11594304,36,"Yes",null,6576,759]
[220,"01820000","Middleborough","Public School District","Superintendent","Brian Lynch","30 Forest Street","","Middleborough","MA","02346","Nancy Labrie","781-338-3536","nancy.h.labrie@mass.gov",null,6,2927303,34,"Yes",null,2875,42]
[221,"01840000","Middleton","Public School District","Superintendent","Scott Morrison","28 Middleton Road","","Boxford","MA","01921","Russ Fleming","781-338-6259","russellw.fleming@mass.gov",null,746,202791,0,"Yes",null,625,11]
[222,"01850000","Milford","Public School District","Superintendent","Kevin Mcintyre","31 West Fountain Street","","Milford","MA","01757","Julia Foodman","781-338-3577","julia.b.foodman@mass.gov",null,64,4454421,85,"Yes",null,4158,902]
[223,"01860000","Millbury","Public School District","Superintendent","Gregory Myers","12 Martin Street","","Millbury","MA","01527","Beth O'Connell","781-338-3132","elizabeth.a.o'connell@mass.gov",null,18,1380582,11,"Yes",null,1536,56]
[224,"01870000","Millis","Public School District","Superintendent","Nancy Gustafson","245 Plain Street","Central Office","Millis","MA","02054","Sue Mazzarella","781-338-3587","susan.mazzarella@mass.gov",null,76,284290,3,"Yes",null,1131,23]
[225,"01890000","Milton","Public School District","Superintendent","Mary Gormley","25 Gile Road","","Milton","MA","02186","Alex Lilley","781-338-6212","alex.j.lilley@mass.gov",null,11,951690,10,"No",null,4247,83]
[226,"08300000","Minuteman Regional Vocational Technical","Public School District","Superintendent","Edward Bouquillon","758 Marrett Rd","","Lexington","MA","02421","Julia Foodman","781-338-3577","julia.b.foodman@mass.gov",null,3,511059,0,"Yes",null,632,5]
[227,"07170000","Mohawk Trail","Public School District","Superintendent","Patricia Bell","24 Ashfield Rd","","Shelburne Falls","MA","01370","Nancy Labrie","781-338-3536","nancy.h.labrie@mass.gov",null,79,1481967,1,"Yes",null,682,5]
[228,"07120000","Monomoy Regional School District","Public School District","Superintendent","Scott Carpenter","425 Crowell Rd","","Chatham","MA","02633","Ellie Rounds-Bloom","781-338-3128","eleanor.rounds@mass.gov",null,9,1502993,55,"Yes",null,1735,83]
[229,"01910000","Monson","Public School District","Superintendent","Cheryl Clarke","P O Box 159","","Monson","MA","01057","Ellie Rounds-Bloom","781-338-3128","eleanor.rounds@mass.gov",null,15,1219840,0,"No",null,818,4]
[230,"08320000","Montachusett Regional Vocational Technical","Public School District","Superintendent","Sheila Harrity","1050 Westminster Street","","Fitchburg","MA","01420","Beth O'Connell","781-338-3132","elizabeth.a.o'connell@mass.gov",null,2,1464932,3,"Yes",null,1399,14]
[231,"07150000","Mount Greylock","Public School District","Superintendent","Kimberley Grady","1781 Cold Spring Rd","","Williamstown","MA","01267","Russ Fleming","781-338-6259","russellw.fleming@mass.gov",null,0,937492,3,"No",null,1050,4]
[232,"04700000","Mystic Valley Regional Charter (District)","Charter District","Charter School Leader","Alex Dan","4 Laurel Street","","Malden","MA","02148","Colleen Holforty","781-338-3522","colleen.e.holforty@mass.gov",null,null,170448,0,null,null,1616,30]
[233,"01960000","Nahant","Public School District","Superintendent","Anthony Pierantozzi","290 Castle Road","","Nahant","MA","01908","Colleen Holforty","781-338-3522","colleen.e.holforty@mass.gov",null,256,177018,0,"Yes",null,134,0]
[234,"01970000","Nantucket","Public School District","Superintendent","William Cozort","10 Surfside Road","","Nantucket","MA","02554","Nancy Labrie","781-338-3536","nancy.h.labrie@mass.gov",null,3,969710,2,"Yes",null,1592,246]
[235,"07200000","Narragansett","Public School District","Superintendent","Christopher Casavant","462 Baldwinville Rd","","Baldwinville","MA","01436","Russ Fleming","781-338-6259","russellw.fleming@mass.gov",null,73,1263273,12,"Yes",null,1293,7]
[236,"07250000","Nashoba","Public School District","Superintendent","Brooke Clenchy","50 Mechanic Street","","Bolton","MA","01740","Julia Foodman","781-338-3577","julia.b.foodman@mass.gov",null,5,831480,3,"Yes",null,3002,91]
[237,"08520000","Nashoba Valley Regional Vocational Technical","Public School District","Superintendent","Denise Pigeon","100 Littleton Road","","Westford","MA","01886","Alex Lilley","781-338-6212","alex.j.lilley@mass.gov",null,177,623090,0,"Yes",null,730,2]
[238,"01980000","Natick","Public School District","Superintendent","Anna Nolin","13 East Central Street","","Natick","MA","01760","Russ Fleming","781-338-6259","russellw.fleming@mass.gov",null,30,1022514,33,"Yes",null,5241,156]
[239,"06600000","Nauset","Public School District","Superintendent","Thomas Conrad","78 Eldredge Pkwy","","Orleans","MA","02653","Julia Foodman","781-338-3577","julia.b.foodman@mass.gov",null,152,1296588,5,"Yes",null,1433,27]
[240,"01990000","Needham","Public School District","Superintendent","Daniel Gutekanst","1330 Highland Avenue","","Needham","MA","02492","Julia Foodman","781-338-3577","julia.b.foodman@mass.gov",null,66,681671,9,"No",null,5519,172]
[241,"04440000","Neighborhood House Charter (District)","Charter District","Charter School Leader","Kate Scott","21 Queen Street","","Dorchester","MA","02122","Colleen Holforty","781-338-3522","colleen.e.holforty@mass.gov",null,3604,4276772,27,"Yes",null,762,75]
[242,"02010000","New Bedford","Public School District","Superintendent","Thomas Anderson","455 County Street","C/O Paul Rodrigues Administration Bldg.","New Bedford","MA","02740","Beth O'Connell","781-338-3132","elizabeth.a.o'connell@mass.gov",null,91,47482075,1125,"Yes",null,12276,3117]
[243,"35130000","New Heights Charter School of Brockton (District)","Charter District","Charter School Leader","Omari Walker","1690 Main Street","","Brockton","MA","02301","Alex Lilley","781-338-6212","alex.j.lilley@mass.gov",null,0,1669510,4,"No",null,741,102]
[244,"07280000","New Salem-Wendell","Public School District","Superintendent","Jennifer Culkeen","18 Pleasant Street","","Erving","MA","01344","Nancy Labrie","781-338-3536","nancy.h.labrie@mass.gov",null,41,190981,1,"Yes",null,114,0]
[245,"02040000","Newburyport","Public School District","Superintendent","Sean Gallagher","70 Low Street","","Newburyport","MA","01950","Sue Mazzarella","781-338-3587","susan.mazzarella@mass.gov",null,780,2199665,5,"Yes",null,2090,45]
[246,"02070000","Newton","Public School District","Superintendent","David Fleishman","100 Walnut Street","","Newtonville","MA","02460","Alex Lilley","781-338-6212","alex.j.lilley@mass.gov",null,21,3368158,33,"No",null,11925,627]
[247,"02080000","Norfolk","Public School District","Superintendent","Ingrid Allardi","70 Boardman Street","","Norfolk","MA","02056","Ellie Rounds-Bloom","781-338-3128","eleanor.rounds@mass.gov",null,1,170448,6,"Yes",null,939,23]
[248,"09150000","Norfolk County Agricultural","Public School District","Superintendent","Tammy Quinn","400 Main Street","","Walpole","MA","02081","Russ Fleming","781-338-6259","russellw.fleming@mass.gov",null,14,315334,2,"Yes",null,580,1]
[249,"02090000","North Adams","Public School District","Superintendent","Barbara Malkas","10 Main Street","Second Floor","North Adams","MA","01247","Colleen Holforty","781-338-3522","colleen.e.holforty@mass.gov",null,96,4252534,50,"Yes",null,1183,9]
[250,"02110000","North Andover","Public School District","Superintendent","Gregg Gilligan","566 Main Street","","North Andover","MA","01845","Russ Fleming","781-338-6259","russellw.fleming@mass.gov",null,113,2981922,11,"Yes",null,4518,97]
[251,"02120000","North Attleborough","Public School District","Superintendent","Scott Holcomb","6 Morse Street","","North Attleborough","MA","02760","Julia Foodman","781-338-3577","julia.b.foodman@mass.gov",null,0,3833177,51,"No",null,3835,113]
[252,"02150000","North Brookfield","Public School District","Superintendent","Richard Lind","10 New School Drive","","North Brookfield","MA","01535","Alex Lilley","781-338-6212","alex.j.lilley@mass.gov",null,40,574924,0,"Yes",null,494,3]
[253,"07350000","North Middlesex","Public School District","Superintendent","Brad Morgan","66 Brookline Street","","Towsend","MA","01469","Alex Lilley","781-338-6212","alex.j.lilley@mass.gov",null,13,2258260,11,"Yes",null,2895,39]
[254,"02170000","North Reading","Public School District","Superintendent","Patrick Daly","189 Park Street","","North Reading","MA","01864","Ellie Rounds-Bloom","781-338-3128","eleanor.rounds@mass.gov",null,92,451952,0,"Yes",null,2287,17]
[255,"02100000","Northampton","Public School District","Superintendent","John Provost","212 Main Street","","Northampton","MA","01060","Nancy Labrie","781-338-3536","nancy.h.labrie@mass.gov",null,7,3391996,28,"Yes",null,2519,104]
[256,"04060000","Northampton-Smith Vocational Agricultural","Public School District","Superintendent","Andrew Linkenhoker","80 Locust Street","","Northampton","MA","01060","Julia Foodman","781-338-3577","julia.b.foodman@mass.gov",null,25,767132,11,"No",null,529,18]
[257,"07300000","Northboro-Southboro","Public School District","Superintendent","Gregory Martineau","53 Parkerville Road","","Southborough","MA","01772","Beth O'Connell","781-338-3132","elizabeth.a.o'connell@mass.gov",null,81,211739,1,"Yes",null,1348,16]
[258,"02130000","Northborough","Public School District","Superintendent","Gregory Martineau","53 Parkerville Road","","Southborough","MA","01772","Beth O'Connell","781-338-3132","elizabeth.a.o'connell@mass.gov",null,48,349517,5,"Yes",null,1551,92]
[259,"02140000","Northbridge","Public School District","Superintendent","Amy McKinstry","87 Linwood Avenue","","Whitinsville","MA","01588","Sue Mazzarella","781-338-3587","susan.mazzarella@mass.gov",null,40,2174018,8,"No",null,1892,47]
[260,"08530000","Northeast Metropolitan Regional Vocational Technical","Public School District","Superintendent","David DiBarri","100 Hemlock Rd","","Wakefield","MA","01880","Ellie Rounds-Bloom","781-338-3128","eleanor.rounds@mass.gov",null,0,2070572,7,"Yes",null,1281,62]
[261,"08510000","Northern Berkshire Regional Vocational Technical","Public School District","Superintendent","James Brosnan","70 Hodges Cross Rd","","North Adams","MA","01247","Alex Chiu","781-338-3586","alexandria.w.chiu@mass.gov",null,29,876875,1,"Yes",null,487,0]
[262,"02180000","Norton","Public School District","Superintendent","Joseph Baeta","64 West Main Street","","Norton","MA","02766","Colleen Holforty","781-338-3522","colleen.e.holforty@mass.gov",null,5,1659927,15,"Yes",null,2326,49]
[263,"02190000","Norwell","Public School District","Superintendent","Matthew Keegan","322 Main Street","","Norwell","MA","02061","Nancy Labrie","781-338-3536","nancy.h.labrie@mass.gov",null,378,170448,0,"Yes",null,2181,7]
[264,"02200000","Norwood","Public School District","Superintendent","David Thomson","275 Prospect Street","PO BOX 67","Norwood","MA","02062","Colleen Holforty","781-338-3522","colleen.e.holforty@mass.gov",null,85,3059236,17,"No",null,3341,435]
[265,"02210000","Oak Bluffs","Public School District","Superintendent","Matthew D'Andrea","4 Pine Street","","Vineyard Haven","MA","02568","Sue Mazzarella","781-338-3587","susan.mazzarella@mass.gov",null,1,1474244,0,"No",null,406,73]
[266,"08550000","Old Colony Regional Vocational Technical","Public School District","Superintendent","Aaron Polansky","476 North Avenue","","Rochester","MA","02770","Colleen Holforty","781-338-3522","colleen.e.holforty@mass.gov",null,0,336005,2,"Yes",null,559,0]
[267,"07400000","Old Rochester","Public School District","Superintendent","Douglas White","135 Marion Rd","","Mattapoisett","MA","02739","Colleen Holforty","781-338-3522","colleen.e.holforty@mass.gov",null,13,258458,8,"Yes",null,1125,1]
[268,"35150000","Old Sturbridge Academy Charter Public School (District)","Charter District","Charter School Leader","Lisa DeTora","2 Old Sturbridge Village Road","","Sturbridge","MA","01566","Colleen Holforty","781-338-3522","colleen.e.holforty@mass.gov",null,9,363598,0,"No",null,280,10]
[269,"02230000","Orange","Public School District","Superintendent","Tari Thomas","507 S. Main Street","P.O. Box 680","Orange","MA","01364","Julia Foodman","781-338-3577","julia.b.foodman@mass.gov",null,15,1414355,22,"No",null,465,7]
[270,"02240000","Orleans","Public School District","Superintendent","Thomas Conrad","78 Eldredge Pkwy","","Orleans","MA","02653","Julia Foodman","781-338-3577","julia.b.foodman@mass.gov",null,8,177018,3,"Yes",null,171,13]
[271,"02260000","Oxford","Public School District","Superintendent","Kristine Nash","4 Maple Road","","Oxford","MA","01540","Alex Lilley","781-338-6212","alex.j.lilley@mass.gov",null,34,3103807,16,"Yes",null,1431,4]
[272,"02270000","Palmer","Public School District","Superintendent","Patricia Gardner","4107 Main Street","","Palmer","MA","01069","Ellie Rounds-Bloom","781-338-3128","eleanor.rounds@mass.gov",null,0,2694278,20,"Yes",null,1166,51]
[273,"08600000","Pathfinder Regional Vocational Technical","Public School District","Superintendent","Gerald Paist","240 Sykes Street","","Palmer","MA","01069","Alex Chiu","781-338-3586","alexandria.w.chiu@mass.gov",null,29,991340,9,"Yes",null,603,1]
[274,"35010000","Paulo Freire Social Justice Charter School (District)","Charter District","Charter School Leader","Isabelina Rodriguez","134 Springfield St","","Chicopee","MA","01013","Julia Foodman","781-338-3577","julia.b.foodman@mass.gov",null,533,2169270,0,"Yes",null,261,15]
[275,"02290000","Peabody","Public School District","Superintendent","Marc Kerble","27 Lowell Street","","Peabody","MA","01960","Sue Mazzarella","781-338-3587","susan.mazzarella@mass.gov",null,28,7515052,108,"Yes",null,5631,504]
[276,"02300000","Pelham","Public School District","Superintendent","Michael Morris","170 Chestnut Street","Business Office","Amherst","MA","01002","Ellie Rounds-Bloom","781-338-3128","eleanor.rounds@mass.gov",null,null,170448,0,null,null,110,2]
[277,"02310000","Pembroke","Public School District","Superintendent","Erin Obey","72 Pilgrim Road","Office of the Superintendent","Pembroke","MA","02359","Alex Chiu","781-338-3586","alexandria.w.chiu@mass.gov",null,7,818076,2,"Yes",null,2566,41]
[278,"07450000","Pentucket","Public School District","Superintendent","Justin Bartholomew","22 Main Street","","West Newbury","MA","01985","Colleen Holforty","781-338-3522","colleen.e.holforty@mass.gov",null,38,1938432,4,"No",null,2161,8]
[279,"02340000","Petersham","Public School District","Superintendent","Tari Thomas","P O Box 148","","Petersham","MA","01366","Julia Foodman","781-338-3577","julia.b.foodman@mass.gov",null,null,177018,0,null,null,121,2]
[280,"35180000","Phoenix Academy Public Charter High School Lawrence (District)","Charter District","Charter School Leader","Beth Anderson","15 Union Street","","Lawrence","MA","01840","Ellie Rounds-Bloom","781-338-3128","eleanor.rounds@mass.gov",null,41,817998,5,"No",null,152,47]
[281,"35080000","Phoenix Academy Public Charter High School Springfield (District)","Charter District","Charter School Leader","Beth Anderson","65 Lincoln Street","","Springfield","MA","01105","Ellie Rounds-Bloom","781-338-3128","eleanor.rounds@mass.gov",null,123,1611352,14,"No",null,204,42]
[282,"04930000","Phoenix Charter Academy (District)","Charter District","Charter School Leader","Beth Anderson","175 Hawthorne Street","","Chelsea","MA","02150","Ellie Rounds-Bloom","781-338-3128","eleanor.rounds@mass.gov",null,213,683829,75,"No",null,210,128]
[283,"04940000","Pioneer Charter School of Science (District)","Charter District","Charter School Leader","Barish Icin","51-59 Summer Street","","Everett","MA","02149","Colleen Holforty","781-338-3522","colleen.e.holforty@mass.gov",null,87,1468278,0,"Yes",null,792,137]
[284,"35060000","Pioneer Charter School of Science II (PCSS-II) (District)","Charter District","Charter School Leader","Barish Icin","97 Main Street","","Saugus","MA","01906","Colleen Holforty","781-338-3522","colleen.e.holforty@mass.gov",null,1,482049,0,"Yes",null,362,74]
[285,"07500000","Pioneer Valley","Public School District","Superintendent","Jonathan Scagel","97 F Sumner Turner Road","","Northfield","MA","01360","Nancy Labrie","781-338-3536","nancy.h.labrie@mass.gov",null,15,614773,0,"No",null,612,8]
[286,"04970000","Pioneer Valley Chinese Immersion Charter (District)","Charter District","Charter School Leader","Kathleen Wang","317 Russell Street","","Hadley","MA","01035","Beth O'Connell","781-338-3132","elizabeth.a.o'connell@mass.gov",null,2,652806,0,"No",null,559,17]
[287,"04790000","Pioneer Valley Performing Arts Charter Public (District)","Charter District","Charter School Leader","Marc Kenen","15 Mulligan Drive","","South Hadley","MA","01075","Beth O'Connell","781-338-3132","elizabeth.a.o'connell@mass.gov",null,237,712047,2,"Yes",null,396,0]
[288,"02360000","Pittsfield","Public School District","Superintendent","Jason Mccandless","269 First Street","","Pittsfield","MA","01201","Beth O'Connell","781-338-3132","elizabeth.a.o'connell@mass.gov",null,29,13152064,53,"No",null,4921,237]
[289,"02380000","Plainville","Public School District","Superintendent","David Raiche","68 Messenger Street","","Plainville","MA","02762","Sue Mazzarella","781-338-3587","susan.mazzarella@mass.gov",null,137,405771,0,"Yes",null,585,21]
[290,"02390000","Plymouth","Public School District","Superintendent","Gary Maestas","11 Lincoln Street","","Plymouth","MA","02360","Sue Mazzarella","781-338-3587","susan.mazzarella@mass.gov",null,0,6415887,45,"Yes",null,6958,192]
[291,"02400000","Plympton","Public School District","Superintendent","Jill Proulx","250 Pembroke Street","","Kingston","MA","02364","Nancy Labrie","781-338-3536","nancy.h.labrie@mass.gov",null,127,170448,0,"No",null,217,1]
[292,"04870000","Prospect Hill Academy Charter (District)","Charter District","Charter School Leader","Angela Allen","50 Essex Street","","Cambridge","MA","02139","Alex Lilley","781-338-6212","alex.j.lilley@mass.gov",null,22,2289323,20,"No",null,1105,159]
[293,"02420000","Provincetown","Public School District","Superintendent","Suzanne Scallion","Provincetown Schools","","Provincetown","MA","02657","Colleen Holforty","781-338-3522","colleen.e.holforty@mass.gov",null,6,617871,12,"Yes",null,114,22]
[294,"07530000","Quabbin","Public School District","Superintendent","Sheila Muir","872 South Street","","Barre","MA","01005","Russ Fleming","781-338-6259","russellw.fleming@mass.gov",null,12,1656525,8,"Yes",null,2032,10]
[295,"07780000","Quaboag Regional","Public School District","Superintendent","Brett Kustigian","284 Old West Brookfield Road","PO Box 1538","Warren","MA","01083","Sue Mazzarella","781-338-3587","susan.mazzarella@mass.gov",null,1546,1641698,5,"Yes",null,1112,16]
[296,"02430000","Quincy","Public School District","Superintendent","Richard Decristofaro","34 Coddington Street","","Quincy","MA","02169","Nancy Labrie","781-338-3536","nancy.h.labrie@mass.gov",null,6,16043084,119,"Yes",null,9278,1465]
[297,"07550000","Ralph C Mahar","Public School District","Superintendent","Tari Thomas","507 South Main Street","","Orange","MA","01364","Julia Foodman","781-338-3577","julia.b.foodman@mass.gov",null,442,917657,12,"Yes",null,625,4]
[298,"02440000","Randolph","Public School District","Superintendent","Thea Stovell","40 Highland Avenue","","Randolph","MA","02368","Russ Fleming","781-338-6259","russellw.fleming@mass.gov",null,42,6870502,46,"Yes",null,2613,419]
[299,"02460000","Reading","Public School District","Superintendent","John Doherty","82 Oakland Road","","Reading","MA","01867","Julia Foodman","781-338-3577","julia.b.foodman@mass.gov",null,1677,838876,5,"Yes",null,3897,51]
[300,"02480000","Revere","Public School District","Superintendent","Dianne Kelly","101 School Street","","Revere","MA","02151","Beth O'Connell","781-338-3132","elizabeth.a.o'connell@mass.gov",null,3,19477086,177,"No",null,7177,1691]
[301,"02490000","Richmond","Public School District","Superintendent","Peter Dillon","1831 State Road","","Richmond","MA","01254","Julia Foodman","781-338-3577","julia.b.foodman@mass.gov",null,null,177018,0,null,null,140,0]
[302,"04830000","Rising Tide Charter Public (District)","Charter District","Charter School Leader","Michael O'Keefe","59 Armstrong Road","","Plymouth","MA","02360","Colleen Holforty","781-338-3522","colleen.e.holforty@mass.gov",null,1,326372,1,"No",null,663,7]
[303,"04820000","River Valley Charter (District)","Charter District","Charter School Leader","Jonnie Lyn Evans","2 Perry Way","","Newburyport","MA","01950","Ellie Rounds-Bloom","781-338-3128","eleanor.rounds@mass.gov",null,2,203460,0,"Yes",null,288,0]
[304,"02500000","Rochester","Public School District","Superintendent","Douglas White","135 Marion Rd","","Mattapoisett","MA","02739","Colleen Holforty","781-338-3522","colleen.e.holforty@mass.gov",null,152,177017,0,"Yes",null,468,2]
[305,"02510000","Rockland","Public School District","Superintendent","Alan Cron","34 MacKinlay Way","","Rockland","MA","02370","Ellie Rounds-Bloom","781-338-3128","eleanor.rounds@mass.gov",null,13,2330432,21,"Yes",null,2148,167]
[306,"02520000","Rockport","Public School District","Superintendent","Robert Liebow","24 Jerdens Lane","","Rockport","MA","01966","Colleen Holforty","781-338-3522","colleen.e.holforty@mass.gov",null,0,937455,0,"No",null,762,5]
[307,"02530000","Rowe","Public School District","Superintendent","John Franzoni","86 Pond Road","","Rowe","MA","01367","Sue Mazzarella","781-338-3587","susan.mazzarella@mass.gov",null,305,177018,0,"No",null,63,0]
[308,"04840000","Roxbury Preparatory Charter (District)","Charter District","Charter School Leader","John Verrilli","120 Fisher Avenue","","Roxbury","MA","02120","Nancy Labrie","781-338-3536","nancy.h.labrie@mass.gov",null,96,10329810,27,"No",null,1595,232]
[309,"04410000","Sabis International Charter (District)","Charter District","Charter School Leader","Maretta Thomsen","160 Joan Street","","Springfield","MA","01129","Alex Lilley","781-338-6212","alex.j.lilley@mass.gov",null,483,5779803,0,"Yes",null,1573,63]
[310,"02580000","Salem","Public School District","Superintendent","Kathleen Smith","29 Highland Avenue","","Salem","MA","01970","Colleen Holforty","781-338-3522","colleen.e.holforty@mass.gov",null,21,9246186,139,"Yes",null,3694,520]
[311,"04850000","Salem Academy Charter (District)","Charter District","Charter School Leader","Kathy Egmont","45 Congress Street","c/o Shetland Pk","Salem","MA","01970","Colleen Holforty","781-338-3522","colleen.e.holforty@mass.gov",null,30,903271,0,"Yes",null,492,15]
[312,"02610000","Sandwich","Public School District","Superintendent","Pamela Gould","33 Water Street","","Sandwich","MA","02563","Julia Foodman","781-338-3577","julia.b.foodman@mass.gov",null,168,2441099,8,"Yes",null,2287,32]
[313,"02620000","Saugus","Public School District","Superintendent","David DeRuosi","23 Main Street","","Saugus","MA","01906","Beth O'Connell","781-338-3132","elizabeth.a.o'connell@mass.gov",null,0,3378724,11,"No",null,2395,156]
[314,"02630000","Savoy","Public School District","Superintendent","John Franzoni","26 Chapel Road","","Savoy","MA","01256","Sue Mazzarella","781-338-3587","susan.mazzarella@mass.gov",null,13,177018,0,"Yes",null,41,0]
[315,"02640000","Scituate","Public School District","Superintendent","Ronald Griffin","606 C J Cushing Hwy","","Scituate","MA","02066","Alex Lilley","781-338-6212","alex.j.lilley@mass.gov",null,66,609334,5,"Yes",null,2807,9]
[316,"02650000","Seekonk","Public School District","Superintendent","Richard Drolet","25 Water Lane","","Seekonk","MA","02771","Ellie Rounds-Bloom","781-338-3128","eleanor.rounds@mass.gov",null,180,1475536,11,"No",null,2010,53]
[317,"02660000","Sharon","Public School District","Superintendent","Victoria Greer","75 Mountain Street","","Sharon","MA","02067","Colleen Holforty","781-338-3522","colleen.e.holforty@mass.gov",null,145,535822,3,"Yes",null,3490,110]
[318,"08710000","Shawsheen Valley Regional Vocational Technical","Public School District","Superintendent","Melanie Hagman","100 Cook Street","","Billerica","MA","01821","Alex Chiu","781-338-3586","alexandria.w.chiu@mass.gov",null,1,718096,10,"Yes",null,1300,1]
[319,"02690000","Sherborn","Public School District","Superintendent","Andrew Keough","157 Farm Street","","Dover","MA","02030","Beth O'Connell","781-338-3132","elizabeth.a.o'connell@mass.gov",null,11,170448,0,"No",null,378,11]
[320,"02710000","Shrewsbury","Public School District","Superintendent","Joseph Sawyer","100 Maple Avenue","","Shrewsbury","MA","01545","Russ Fleming","781-338-6259","russellw.fleming@mass.gov",null,169,1229980,16,"Yes",null,5906,158]
[321,"02720000","Shutesbury","Public School District","Superintendent","Jennifer Culkeen","18 Pleasant Street","","Erving","MA","01344","Nancy Labrie","781-338-3536","nancy.h.labrie@mass.gov",null,1,177018,0,"No",null,102,0]
[322,"07600000","Silver Lake","Public School District","Superintendent","Jill Proulx","250 Pembroke Street","","Kingston","MA","02364","Nancy Labrie","781-338-3536","nancy.h.labrie@mass.gov",null,10,449514,6,"Yes",null,1586,17]
[323,"04740000","Sizer School: A North Central Charter Essential (District)","Charter District","Charter School Leader","Frederick Randall","500 Rindge Road","","Fitchburg","MA","01420","Nancy Labrie","781-338-3536","nancy.h.labrie@mass.gov",null,4,715749,10,"No",null,368,11]
[324,"02730000","Somerset","Public School District","Superintendent","Jeffrey Schoonover","580 Whetstone Hill Road","","Somerset","MA","02726","Russ Fleming","781-338-6259","russellw.fleming@mass.gov",null,17,1483290,2,"Yes",null,1587,16]
[325,"07630000","Somerset Berkley Regional School District","Public School District","Superintendent","Jeffrey Schoonover","580 Whetstone Hill","","Somerset","MA","02726","Russ Fleming","781-338-6259","russellw.fleming@mass.gov",null,2,266623,2,"Yes",null,1010,1]
[326,"02740000","Somerville","Public School District","Superintendent","Mary Skipper","8 Bonair Street","","Somerville","MA","02145","Colleen Holforty","781-338-3522","colleen.e.holforty@mass.gov",null,930,8316741,68,"Yes",null,4440,851]
[327,"02780000","South Hadley","Public School District","Superintendent","Diana Bonneville","116 Main Street","","South Hadley","MA","01075","Nancy Labrie","781-338-3536","nancy.h.labrie@mass.gov",null,78,1591388,16,"Yes",null,1703,78]
[328,"08290000","South Middlesex Regional Vocational Technical","Public School District","Superintendent","Jonathan Evans","750 Winter Street","","Framingham","MA","01702","Russ Fleming","781-338-6259","russellw.fleming@mass.gov",null,102,1553464,1,"No",null,807,143]
[329,"04880000","South Shore Charter Public (District)","Charter District","Charter School Leader","Alicia Savage","100 Longwater Circle","","Norwell","MA","02061","Sue Mazzarella","781-338-3587","susan.mazzarella@mass.gov",null,141,781046,1,"No",null,1006,117]
[330,"08730000","South Shore Regional Vocational Technical","Public School District","Superintendent","Thomas Hickey","476 Webster Street","","Hanover","MA","02339","Beth O'Connell","781-338-3132","elizabeth.a.o'connell@mass.gov",null,3,484837,1,"Yes",null,639,5]
[331,"02750000","Southampton","Public School District","Superintendent","Aaron Osborne","19 Stage Rd","","Westhampton","MA","01027","Nancy Labrie","781-338-3536","nancy.h.labrie@mass.gov",null,10,244103,0,"Yes",null,424,8]
[332,"02760000","Southborough","Public School District","Superintendent","Gregory Martineau","53 Parkerville Road","","Southborough","MA","01772","Beth O'Connell","781-338-3132","elizabeth.a.o'connell@mass.gov",null,76,281464,0,"Yes",null,1147,74]
[333,"02770000","Southbridge","Public School District","Superintendent","Jeffrey Villar","25 Cole Avenue","","Southbridge","MA","01550","Ellie Rounds-Bloom","781-338-3128","eleanor.rounds@mass.gov",null,444,6499629,62,"Yes",null,1822,367]
[334,"08720000","Southeastern Regional Vocational Technical","Public School District","Superintendent","Luis Lopes","250 Foundry Street","","South Easton","MA","02375","Julia Foodman","781-338-3577","julia.b.foodman@mass.gov",null,15,1771710,10,"No",null,1525,55]
[335,"07650000","Southern Berkshire","Public School District","Superintendent","Beth Regulbuto","PO BOX 339","","Sheffield","MA","01257","Alex Lilley","781-338-6212","alex.j.lilley@mass.gov",null,11,1309958,4,"Yes",null,616,10]
[336,"08760000","Southern Worcester County Regional Vocational Technical","Public School District","Superintendent","John LaFleche","57 Old Muggett Hill Road","","Charlton","MA","01507","Alex Chiu","781-338-3586","alexandria.w.chiu@mass.gov",null,6,1043402,0,"Yes",null,1154,10]
[337,"07660000","Southwick-Tolland-Granville Regional School District","Public School District","Superintendent","Jennifer Willard","86 Powder Mill Road","","Southwick","MA","01077","Ellie Rounds-Bloom","781-338-3128","eleanor.rounds@mass.gov",null,49,2123658,2,"Yes",null,1366,43]
[338,"07670000","Spencer-E Brookfield","Public School District","Superintendent","Paul Haughey","306 Main Street","","Spencer","MA","01562","Colleen Holforty","781-338-3522","colleen.e.holforty@mass.gov",null,61,1702776,10,"Yes",null,1296,49]
[339,"02810000","Springfield","Public School District","Superintendent","Daniel Warwick","1550 Main Street","","Springfield","MA","01103","Alex Lilley","781-338-6212","alex.j.lilley@mass.gov",null,4101,156313280,1156,"Yes",null,22941,3684]
[340,"35100000","Springfield Preparatory Charter School (District)","Charter District","Charter School Leader","Bill Spirer","594 Converse St.","","Longmeadow","MA","01106","Beth O'Connell","781-338-3132","elizabeth.a.o'connell@mass.gov",null,55,2400463,3,"Yes",null,380,60]
[341,"02840000","Stoneham","Public School District","Superintendent","John Macero","149 Franklin Street","","Stoneham","MA","02180","Julia Foodman","781-338-3577","julia.b.foodman@mass.gov",null,85,1053694,7,"Yes",null,2208,74]
[342,"02850000","Stoughton","Public School District","Superintendent","John Marcus","232 Pearl Street","","Stoughton","MA","02072","Beth O'Connell","781-338-3132","elizabeth.a.o'connell@mass.gov",null,257,3800419,41,"Yes",null,3335,259]
[343,"02870000","Sturbridge","Public School District","Superintendent","Erin Nosek","320 Brookfield Rd","","Fiskdale","MA","01518","Russ Fleming","781-338-6259","russellw.fleming@mass.gov",null,12,571267,2,"Yes",null,763,30]
[344,"04890000","Sturgis Charter Public (District)","Charter District","Charter School Leader","Paul Marble","427 Main Street","","Hyannis","MA","02601","Alex Lilley","781-338-6212","alex.j.lilley@mass.gov",null,null,177018,2,null,null,851,12]
[345,"02880000","Sudbury","Public School District","Superintendent","Brad Crozier","40 Fairbank Road","","Sudbury","MA","01776","Alex Lilley","781-338-6212","alex.j.lilley@mass.gov",null,58,503034,2,"Yes",null,2497,57]
[346,"02890000","Sunderland","Public School District","Superintendent","Darius Modestow","113 North Main Street, Office C101","","South Deerfield","MA","01373","Alex Lilley","781-338-6212","alex.j.lilley@mass.gov",null,16,177018,6,"Yes",null,169,14]
[347,"02900000","Sutton","Public School District","Superintendent","Theodore Friend","383 Boston Rd","","Sutton","MA","01590","Russ Fleming","781-338-6259","russellw.fleming@mass.gov",null,14,270580,5,"Yes",null,1236,25]
[348,"02910000","Swampscott","Public School District","Superintendent","Pamela Angelakis","207 Forest Avenue","","Swampscott","MA","01907","Nancy Labrie","781-338-3536","nancy.h.labrie@mass.gov",null,119,1483261,13,"Yes",null,2080,110]
[349,"02920000","Swansea","Public School District","Superintendent","John Robidoux","1 Gardners Neck Road","","Swansea","MA","02777","Russ Fleming","781-338-6259","russellw.fleming@mass.gov",null,7,2026164,11,"Yes",null,1981,8]
[350,"07700000","Tantasqua","Public School District","Superintendent","Erin Nosek","320A Brookfield Rd","","Fiskdale","MA","01518","Russ Fleming","781-338-6259","russellw.fleming@mass.gov",null,7,954526,13,"Yes",null,1776,13]
[351,"02930000","Taunton","Public School District","Superintendent","John Cabral","215 Harris Street","","Taunton","MA","02780","Julia Foodman","781-338-3577","julia.b.foodman@mass.gov",null,413,17015439,92,"Yes",null,7642,428]
[352,"39020000","TEC Connections Academy Commonwealth Virtual School District","Public School District","Superintendent","Patrick Lattuca","141 Mansion Drive","","East Walpole","MA","02032","Russ Fleming","781-338-6259","russellw.fleming@mass.gov",null,40,6498719,0,"Yes",null,2546,32]
[353,"02950000","Tewksbury","Public School District","Superintendent","Christopher Malone","139 Pleasant Street","","Tewksbury","MA","01876","Beth O'Connell","781-338-3132","elizabeth.a.o'connell@mass.gov",null,57,2773695,12,"Yes",null,3115,68]
[354,"02960000","Tisbury","Public School District","Superintendent","Matthew D'Andrea","4 Pine Street","","Vineyard Haven","MA","02568","Sue Mazzarella","781-338-3587","susan.mazzarella@mass.gov",null,63,504074,0,"No",null,265,72]
[355,"02980000","Topsfield","Public School District","Superintendent","Scott Morrison","28 Middleton Road","","Boxford","MA","01921","Russ Fleming","781-338-6259","russellw.fleming@mass.gov",null,2,687097,2,"Yes",null,552,2]
[356,"08780000","Tri-County Regional Vocational Technical","Public School District","Superintendent","Stephen Dockray","147 Pond Street","","Franklin","MA","02038","Alex Lilley","781-338-6212","alex.j.lilley@mass.gov",null,1,643879,8,"No",null,943,2]
[357,"07730000","Triton","Public School District","Superintendent","Brian Forget","112 Elm Street","","Byfield","MA","01922","Russ Fleming","781-338-6259","russellw.fleming@mass.gov",null,26,1965791,210,"Yes",null,2113,23]
[358,"03000000","Truro","Public School District","Superintendent","Michael Gradone","P O Box 2029","","Truro","MA","02666","Ellie Rounds-Bloom","781-338-3128","eleanor.rounds@mass.gov",null,0,170448,0,"No",null,93,0]
[359,"03010000","Tyngsborough","Public School District","Superintendent","Michael Flanagan","50 Norris Rd","","Tyngsborough","MA","01879","Colleen Holforty","781-338-3522","colleen.e.holforty@mass.gov",null,41,509654,4,"Yes",null,1560,75]
[360,"04800000","UP Academy Charter School of Boston (District)","Charter District","Charter School Leader","Rashidah Lawson","215 Dorchester Street","","Boston","MA","02127","Ellie Rounds-Bloom","781-338-3128","eleanor.rounds@mass.gov",null,150,4228203,34,"Yes",null,352,86]
[361,"35050000","UP Academy Charter School of Dorchester (District)","Charter District","Charter School Leader","Erica Andrew","35 Westville Street","","Boston","MA","02124","Ellie Rounds-Bloom","781-338-3128","eleanor.rounds@mass.gov",null,206,4883530,34,"No",null,632,200]
[362,"07740000","Up-Island Regional","Public School District","Superintendent","Matthew D'Andrea","4 Pine Street","","Vineyard Haven","MA","02568","Sue Mazzarella","781-338-3587","susan.mazzarella@mass.gov",null,23,391943,2,"Yes",null,402,24]
[363,"08790000","Upper Cape Cod Regional Vocational Technical","Public School District","Superintendent","Robert Dutch","220 Sandwich Rd","","Bourne","MA","02532","Ellie Rounds-Bloom","781-338-3128","eleanor.rounds@mass.gov",null,0,684570,3,"No",null,711,0]
[364,"03040000","Uxbridge","Public School District","Superintendent","Frank Tiano","9 North Main Street","","Uxbridge","MA","01569","Nancy Labrie","781-338-3536","nancy.h.labrie@mass.gov",null,28,2187022,3,"Yes",null,1588,27]
[365,"04980000","Veritas Preparatory Charter School (District)","Charter District","Charter School Leader","Rachel Romano","370 Pine Street","","Springfield","MA","01105","Sue Mazzarella","781-338-3587","susan.mazzarella@mass.gov",null,27,3319174,15,"Yes",null,408,19]
[366,"07750000","Wachusett","Public School District","Superintendent","Darryll McCall","1745 Main Street","c/o Jefferson School","Jefferson","MA","01522","Beth O'Connell","781-338-3132","elizabeth.a.o'connell@mass.gov",null,122,1365773,9,"Yes",null,6513,121]
[367,"03050000","Wakefield","Public School District","Superintendent","Douglas Lyons","60 Farm Street","","Wakefield","MA","01880","Russ Fleming","781-338-6259","russellw.fleming@mass.gov",null,78,822817,11,"Yes",null,3262,83]
[368,"03060000","Wales","Public School District","Superintendent","Erin Nosek","320 Brookfield Rd","","Fiskdale","MA","01518","Russ Fleming","781-338-6259","russellw.fleming@mass.gov",null,0,257781,1,"Yes",null,114,1]
[369,"03070000","Walpole","Public School District","Superintendent","Bridget Gough","135 School Street","","Walpole","MA","02081","Beth O'Connell","781-338-3132","elizabeth.a.o'connell@mass.gov",null,118,945168,4,"Yes",null,3617,126]
[370,"03080000","Waltham","Public School District","Superintendent","George Frost","617 Lexington Street","","Waltham","MA","02452","Sue Mazzarella","781-338-3587","susan.mazzarella@mass.gov",null,1312,5492133,148,"Yes",null,5414,1250]
[371,"03090000","Ware","Public School District","Superintendent","Marlene Di Leo","P O Box 240","","Ware","MA","01082","Alex Lilley","781-338-6212","alex.j.lilley@mass.gov",null,12,2336995,2,"Yes",null,1100,19]
[372,"03100000","Wareham","Public School District","Superintendent","Kimberly Shaver-Hood","48 Marion Road","","Wareham","MA","02571","Ellie Rounds-Bloom","781-338-3128","eleanor.rounds@mass.gov",null,29,4131421,21,"Yes",null,1957,29]
[373,"03140000","Watertown","Public School District","Superintendent","Deanne Galdston","30 Common Street","","Watertown","MA","02472","Colleen Holforty","781-338-3522","colleen.e.holforty@mass.gov",null,337,2868929,22,"Yes",null,2451,344]
[374,"03150000","Wayland","Public School District","Superintendent","Arthur Unobskey","41 Cochituate Rd","","Wayland","MA","01778","Nancy Labrie","781-338-3536","nancy.h.labrie@mass.gov",null,109,409989,0,"Yes",null,2728,94]
[375,"03160000","Webster","Public School District","Superintendent","Ruthann Petruno-Goguen","77 Poland Street","","Webster","MA","01570","Russ Fleming","781-338-6259","russellw.fleming@mass.gov",null,168,4630098,18,"Yes",null,1645,188]
[376,"03170000","Wellesley","Public School District","Superintendent","David Lussier","40 Kingsbury Street","","Wellesley","MA","02481","Julia Foodman","781-338-3577","julia.b.foodman@mass.gov",null,116,982642,11,"Yes",null,4394,84]
[377,"03180000","Wellfleet","Public School District","Superintendent","Thomas Conrad","78 Eldredge Pkwy","","Orleans","MA","02653","Julia Foodman","781-338-3577","julia.b.foodman@mass.gov",null,1,170448,0,"Yes",null,99,1]
[378,"03220000","West Boylston","Public School District","Superintendent","Elizabeth Schaper","125 Crescent Street","","West Boylston","MA","01583","Alex Lilley","781-338-6212","alex.j.lilley@mass.gov",null,30,691385,8,"Yes",null,866,31]
[379,"03230000","West Bridgewater","Public School District","Superintendent","Patricia Oakley","2 Spring Street","","West Bridgewater","MA","02379","Ellie Rounds-Bloom","781-338-3128","eleanor.rounds@mass.gov",null,20,534931,6,"Yes",null,1338,24]
[380,"03320000","West Springfield","Public School District","Superintendent","Timothy Connor","26 Central Street","","West Springfield","MA","01089","Alex Lilley","781-338-6212","alex.j.lilley@mass.gov",null,436,9737389,97,"Yes",null,3830,395]
[381,"03210000","Westborough","Public School District","Superintendent","Amber Bock","45 West Main Street","","Westborough","MA","01581","Sue Mazzarella","781-338-3587","susan.mazzarella@mass.gov",null,406,634890,11,"Yes",null,3762,378]
[382,"03250000","Westfield","Public School District","Superintendent","Stefan Czaporowski","94 North Elm Street","Suite 101","Westfield","MA","01085","Alex Lilley","781-338-6212","alex.j.lilley@mass.gov",null,311,10784275,47,"Yes",null,4806,252]
[383,"03260000","Westford","Public School District","Superintendent","Everett Olsen","23 Depot Street","","Westford","MA","01886","Nancy Labrie","781-338-3536","nancy.h.labrie@mass.gov",null,null,587730,3,null,null,4728,99]
[384,"03270000","Westhampton","Public School District","Superintendent","Aaron Osborne","19 Stage Rd","","Westhampton","MA","01027","Nancy Labrie","781-338-3536","nancy.h.labrie@mass.gov",null,null,177018,0,null,null,98,0]
[385,"03300000","Weston","Public School District","Superintendent","Midge Connolly","89 Wellesley Street","","Weston","MA","02493","Julia Foodman","781-338-3577","julia.b.foodman@mass.gov",null,69,1836674,0,"Yes",null,1895,69]
[386,"03310000","Westport","Public School District","Superintendent","Gary Reese","17 Main Rd","","Westport","MA","02790","Beth O'Connell","781-338-3132","elizabeth.a.o'connell@mass.gov",null,14,1607934,2,"Yes",null,1333,15]
[387,"03350000","Westwood","Public School District","Superintendent","Emily Parks","220 Nahatan Street","","Westwood","MA","02090","Alex Lilley","781-338-6212","alex.j.lilley@mass.gov",null,null,170448,0,null,null,2914,27]
[388,"03360000","Weymouth","Public School District","Superintendent","Jennifer Curtis-Whipple","111 Middle Street","","Weymouth","MA","02189","Ellie Rounds-Bloom","781-338-3128","eleanor.rounds@mass.gov",null,252,6771232,106,"Yes",null,5480,312]
[389,"03370000","Whately","Public School District","Superintendent","Darius Modestow","113 North Main Street, Office C101","","South Deerfield","MA","01373","Alex Lilley","781-338-6212","alex.j.lilley@mass.gov",null,null,177018,0,null,null,105,3]
[390,"07800000","Whitman-Hanson","Public School District","Superintendent","Jeffrey Szymaniak","610 Franklin Street","","Whitman","MA","02382","Alex Lilley","781-338-6212","alex.j.lilley@mass.gov",null,38,2314697,16,"Yes",null,3536,32]
[391,"08850000","Whittier Regional Vocational Technical","Public School District","Superintendent","Maureen Lynch","115 Amesbury Line Rd","","Haverhill","MA","01830","Colleen Holforty","781-338-3522","colleen.e.holforty@mass.gov",null,14,1864912,3,"Yes",null,1234,16]
[392,"03400000","Williamsburg","Public School District","Superintendent","Aaron Osborne","19 Stage Rd","","Westhampton","MA","01027","Nancy Labrie","781-338-3536","nancy.h.labrie@mass.gov",null,5,170448,0,"Yes",null,114,1]
[393,"03420000","Wilmington","Public School District","Superintendent","Glenn Brand","161 Church Street","","Wilmington","MA","01887","Alex Chiu","781-338-3586","alexandria.w.chiu@mass.gov",null,36,810210,10,"Yes",null,2849,27]
[394,"03430000","Winchendon","Public School District","Superintendent","Joan Landers","175 Grove Street","","Winchendon","MA","01475","Beth O'Connell","781-338-3132","elizabeth.a.o'connell@mass.gov",null,8,2435895,15,"Yes",null,1131,11]
[395,"03440000","Winchester","Public School District","Superintendent","Judith Evans","40 Samoset Road","","Winchester","MA","01890","Sue Mazzarella","781-338-3587","susan.mazzarella@mass.gov",null,125,761798,13,"Yes",null,4454,128]
[396,"03460000","Winthrop","Public School District","Superintendent","Lisa Howard","1 Metcalf Square","","Winthrop","MA","02152","Alex Lilley","781-338-6212","alex.j.lilley@mass.gov",null,162,3086146,9,"Yes",null,1820,127]
[397,"03470000","Woburn","Public School District","Superintendent","Matthew Crowley","55 Locust Street","","Woburn","MA","01801","Ellie Rounds-Bloom","781-338-3128","eleanor.rounds@mass.gov",null,321,4551790,17,"Yes",null,4179,326]
[398,"03480000","Worcester","Public School District","Superintendent","Maureen Binienda","20 Irving Street","","Worcester","MA","01609","Russ Fleming","781-338-6259","russellw.fleming@mass.gov",null,7774,78224272,2370,"Yes",null,23571,6614]
[399,"03490000","Worthington","Public School District","Superintendent","Gretchen Morse-Dobosz","147 Huntington Road","","Worthington","MA","01098","Nancy Labrie","781-338-3536","nancy.h.labrie@mass.gov",null,0,177018,0,"No",null,59,0]
[400,"03500000","Wrentham","Public School District","Superintendent","Allan Cameron","120 Taunton Street","","Wrentham","MA","02093","Russ Fleming","781-338-6259","russellw.fleming@mass.gov",null,23,205111,6,"Yes",null,830,21]

{"sheet":"dataSchoolInfo","index":5,"n_rows":1840,"n_cols":20,"rows_kept":1840,"cut":false,"hidden":true,"merged":[]}
["ORG_CODE","School Name","School Code",null,"Gradeserved","TitleIStatus","March 21 Enrolled All",null,"sch_type20","March 21 ECODIS All"," March 21ECODIS All x 1.6"]
["0001","Abington Early Education Program","00010001",null,"PK","NT",60,null,"EES",17,0,null,null,"District Code","EcoDis Rank","School Code","School Name","# EcoDis","TotEnroll","% ecodis"]
["0001","Woodsdale Elementary School","00010015",null,"03 - 04","NT",313,null,"ES",79,126.4,null,null,{"$f":"valorg4code","v":"0014"},{"$f":"IFERROR((RANK(T3,$T$3:$T$191,0)+COUNTIF($T$3:T3, T3)-1), \"\")","v":5},{"$f":"IFERROR(INDEX($C$2:$C$1840,_xlfn.AGGREGATE(15,3,(($A$2:$A$1840=$N$3)/($A$2:$A$1840=$N$3)*ROW($A$2:$A$1840))-ROW($A$1), ROWS($M$3:M3))), \"\")","v":"00140005"},{"$f":"IFERROR(INDEX($B$2:$B$1840,_xlfn.AGGREGATE(15,3,(($A$2:$A$1840=$N$3)/($A$2:$A$1840=$N$3)*ROW($A$2:$A$1840))-ROW($A$1), ROWS($M$3:M3))), \"\")","v":"William Pittaway Elementary"},{"$f":"IFERROR(INDEX($J$2:$J$1840,_xlfn.AGGREGATE(15,3,(($A$2:$A$1840=$N$3)/($A$2:$A$1840=$N$3)*ROW($A$2:$A$1840))-ROW($A$1), ROWS($M$3:M3))), \"\")","v":6},{"$f":"IFERROR(INDEX($G$2:$G$1840,_xlfn.AGGREGATE(15,3,(($A$2:$A$1840=$N$3)/($A$2:$A$1840=$N$3)*ROW($A$2:$A$1840))-ROW($A$1), ROWS($M$3:M3))), \"\")","v":56},{"$f":"IFERROR(R3/S3, \"\")","v":0.10714285714285714}]
["0001","Beaver Brook Elementary","00010020",null,"K - 02","TA",499,null,"EES",151,241.60000000000002,null,null,null,{"$f":"IFERROR((RANK(T4,$T$3:$T$191,0)+COUNTIF($T$3:T4, T4)-1), \"\")","v":2},{"$f":"IFERROR(INDEX($C$2:$C$1840,_xlfn.AGGREGATE(15,3,(($A$2:$A$1840=$N$3)/($A$2:$A$1840=$N$3)*ROW($A$2:$A$1840))-ROW($A$1), ROWS($M$3:M4))), \"\")","v":"00140010"},{"$f":"IFERROR(INDEX($B$2:$B$1840,_xlfn.AGGREGATE(15,3,(($A$2:$A$1840=$N$3)/($A$2:$A$1840=$N$3)*ROW($A$2:$A$1840))-ROW($A$1), ROWS($M$3:M4))), \"\")","v":"Henry E Warren Elementary"},{"$f":"IFERROR(INDEX($J$2:$J$1840,_xlfn.AGGREGATE(15,3,(($A$2:$A$1840=$N$3)/($A$2:$A$1840=$N$3)*ROW($A$2:$A$1840))-ROW($A$1), ROWS($M$3:M4))), \"\")","v":115},{"$f":"IFERROR(INDEX($G$2:$G$1840,_xlfn.AGGREGATE(15,3,(($A$2:$A$1840=$N$3)/($A$2:$A$1840=$N$3)*ROW($A$2:$A$1840))-ROW($A$1), ROWS($M$3:M4))), \"\")","v":578},0.19896193771626297]
["0001","Abington Middle School","00010405",null,"05 - 08","NT",632,null,"MS",205,328,null,null,null,{"$f":"IFERROR((RANK(T5,$T$3:$T$191,0)+COUNTIF($T$3:T5, T5)-1), \"\")","v":3},{"$f":"IFERROR(INDEX($C$2:$C$1840,_xlfn.AGGREGATE(15,3,(($A$2:$A$1840=$N$3)/($A$2:$A$1840=$N$3)*ROW($A$2:$A$1840))-ROW($A$1), ROWS($M$3:M5))), \"\")","v":"00140015"},{"$f":"IFERROR(INDEX($B$2:$B$1840,_xlfn.AGGREGATE(15,3,(($A$2:$A$1840=$N$3)/($A$2:$A$1840=$N$3)*ROW($A$2:$A$1840))-ROW($A$1), ROWS($M$3:M5))), \"\")","v":"David Mindess"},{"$f":"IFERROR(INDEX($J$2:$J$1840,_xlfn.AGGREGATE(15,3,(($A$2:$A$1840=$N$3)/($A$2:$A$1840=$N$3)*ROW($A$2:$A$1840))-ROW($A$1), ROWS($M$3:M5))), \"\")","v":107},{"$f":"IFERROR(INDEX($G$2:$G$1840,_xlfn.AGGREGATE(15,3,(($A$2:$A$1840=$N$3)/($A$2:$A$1840=$N$3)*ROW($A$2:$A$1840))-ROW($A$1), ROWS($M$3:M5))), \"\")","v":634},0.16876971608832808]
["0001","Abington High","00010505",null,"09 - 12","NT",618,null,"HS",168,259.2,null,null,null,{"$f":"IFERROR((RANK(T6,$T$3:$T$191,0)+COUNTIF($T$3:T6, T6)-1), \"\")","v":1},{"$f":"IFERROR(INDEX($C$2:$C$1840,_xlfn.AGGREGATE(15,3,(($A$2:$A$1840=$N$3)/($A$2:$A$1840=$N$3)*ROW($A$2:$A$1840))-ROW($A$1), ROWS($M$3:M6))), \"\")","v":"00140405"},{"$f":"IFERROR(INDEX($B$2:$B$1840,_xlfn.AGGREGATE(15,3,(($A$2:$A$1840=$N$3)/($A$2:$A$1840=$N$3)*ROW($A$2:$A$1840))-ROW($A$1), ROWS($M$3:M6))), \"\")","v":"Ashland Middle"},{"$f":"IFERROR(INDEX($J$2:$J$1840,_xlfn.AGGREGATE(15,3,(($A$2:$A$1840=$N$3)/($A$2:$A$1840=$N$3)*ROW($A$2:$A$1840))-ROW($A$1), ROWS($M$3:M6))), \"\")","v":137},{"$f":"IFERROR(INDEX($G$2:$G$1840,_xlfn.AGGREGATE(15,3,(($A$2:$A$1840=$N$3)/($A$2:$A$1840=$N$3)*ROW($A$2:$A$1840))-ROW($A$1), ROWS($M$3:M6))), \"\")","v":671},0.20417287630402384]
["0003","Acushnet Elementary School","00030025",null,"PK - 04","TA",495,null,"ES",148,225.60000000000002,null,null,null,{"$f":"IFERROR((RANK(T7,$T$3:$T$191,0)+COUNTIF($T$3:T7, T7)-1), \"\")","v":4},{"$f":"IFERROR(INDEX($C$2:$C$1840,_xlfn.AGGREGATE(15,3,(($A$2:$A$1840=$N$3)/($A$2:$A$1840=$N$3)*ROW($A$2:$A$1840))-ROW($A$1), ROWS($M$3:M7))), \"\")","v":"00140505"},{"$f":"IFERROR(INDEX($B$2:$B$1840,_xlfn.AGGREGATE(15,3,(($A$2:$A$1840=$N$3)/($A$2:$A$1840=$N$3)*ROW($A$2:$A$1840))-ROW($A$1), ROWS($M$3:M7))), \"\")","v":"Ashland High"},{"$f":"IFERROR(INDEX($J$2:$J$1840,_xlfn.AGGREGATE(15,3,(($A$2:$A$1840=$N$3)/($A$2:$A$1840=$N$3)*ROW($A$2:$A$1840))-ROW($A$1), ROWS($M$3:M7))), \"\")","v":132},{"$f":"IFERROR(INDEX($G$2:$G$1840,_xlfn.AGGREGATE(15,3,(($A$2:$A$1840=$N$3)/($A$2:$A$1840=$N$3)*ROW($A$2:$A$1840))-ROW($A$1), ROWS($M$3:M7))), \"\")","v":806},0.16377171215880892]
["0003","Albert F Ford Middle School","00030305",null,"05 - 08","NT",421,null,"MS",117,187.20000000000002,null,null,null,{"$f":"IFERROR((RANK(T8,$T$3:$T$191,0)+COUNTIF($T$3:T8, T8)-1), \"\")","v":""},{"$f":"IFERROR(INDEX($C$2:$C$1840,_xlfn.AGGREGATE(15,3,(($A$2:$A$1840=$N$3)/($A$2:$A$1840=$N$3)*ROW($A$2:$A$1840))-ROW($A$1), ROWS($M$3:M8))), \"\")","v":""},{"$f":"IFERROR(INDEX($B$2:$B$1840,_xlfn.AGGREGATE(15,3,(($A$2:$A$1840=$N$3)/($A$2:$A$1840=$N$3)*ROW($A$2:$A$1840))-ROW($A$1), ROWS($M$3:M8))), \"\")","v":""},{"$f":"IFERROR(INDEX($J$2:$J$1840,_xlfn.AGGREGATE(15,3,(($A$2:$A$1840=$N$3)/($A$2:$A$1840=$N$3)*ROW($A$2:$A$1840))-ROW($A$1), ROWS($M$3:M8))), \"\")","v":""},{"$f":"IFERROR(INDEX($G$2:$G$1840,_xlfn.AGGREGATE(15,3,(($A$2:$A$1840=$N$3)/($A$2:$A$1840=$N$3)*ROW($A$2:$A$1840))-ROW($A$1), ROWS($M$3:M8))), \"\")","v":""},""]
["0005","Agawam Early Childhood Center","00050003",null,"PK","NT",110,null,"EES",46,0,null,null,null,{"$f":"IFERROR((RANK(T9,$T$3:$T$191,0)+COUNTIF($T$3:T9, T9)-1), \"\")","v":""},{"$f":"IFERROR(INDEX($C$2:$C$1840,_xlfn.AGGREGATE(15,3,(($A$2:$A$1840=$N$3)/($A$2:$A$1840=$N$3)*ROW($A$2:$A$1840))-ROW($A$1), ROWS($M$3:M9))), \"\")","v":""},{"$f":"IFERROR(INDEX($B$2:$B$1840,_xlfn.AGGREGATE(15,3,(($A$2:$A$1840=$N$3)/($A$2:$A$1840=$N$3)*ROW($A$2:$A$1840))-ROW($A$1), ROWS($M$3:M9))), \"\")","v":""},{"$f":"IFERROR(INDEX($J$2:$J$1840,_xlfn.AGGREGATE(15,3,(($A$2:$A$1840=$N$3)/($A$2:$A$1840=$N$3)*ROW($A$2:$A$1840))-ROW($A$1), ROWS($M$3:M9))), \"\")","v":""},{"$f":"IFERROR(INDEX($G$2:$G$1840,_xlfn.AGGREGATE(15,3,(($A$2:$A$1840=$N$3)/($A$2:$A$1840=$N$3)*ROW($A$2:$A$1840))-ROW($A$1), ROWS($M$3:M9))), \"\")","v":""},""]
["0005","Clifford M Granger","00050010",null,"K - 04","SW",247,null,"ES",101,161.60000000000002,null,null,null,{"$f":"IFERROR((RANK(T10,$T$3:$T$191,0)+COUNTIF($T$3:T10, T10)-1), \"\")","v":""},{"$f":"IFERROR(INDEX($C$2:$C$1840,_xlfn.AGGREGATE(15,3,(($A$2:$A$1840=$N$3)/($A$2:$A$1840=$N$3)*ROW($A$2:$A$1840))-ROW($A$1), ROWS($M$3:M10))), \"\")","v":""},{"$f":"IFERROR(INDEX($B$2:$B$1840,_xlfn.AGGREGATE(15,3,(($A$2:$A$1840=$N$3)/($A$2:$A$1840=$N$3)*ROW($A$2:$A$1840))-ROW($A$1), ROWS($M$3:M10))), \"\")","v":""},{"$f":"IFERROR(INDEX($J$2:$J$1840,_xlfn.AGGREGATE(15,3,(($A$2:$A$1840=$N$3)/($A$2:$A$1840=$N$3)*ROW($A$2:$A$1840))-ROW($A$1), ROWS($M$3:M10))), \"\")","v":""},{"$f":"IFERROR(INDEX($G$2:$G$1840,_xlfn.AGGREGATE(15,3,(($A$2:$A$1840=$N$3)/($A$2:$A$1840=$N$3)*ROW($A$2:$A$1840))-ROW($A$1), ROWS($M$3:M10))), \"\")","v":""},""]
["0005","Benjamin J Phelps","00050020",null,"K - 04","SW",348,null,"ES",131,209.60000000000002,null,null,null,{"$f":"IFERROR((RANK(T11,$T$3:$T$191,0)+COUNTIF($T$3:T11, T11)-1), \"\")","v":""},{"$f":"IFERROR(INDEX($C$2:$C$1840,_xlfn.AGGREGATE(15,3,(($A$2:$A$1840=$N$3)/($A$2:$A$1840=$N$3)*ROW($A$2:$A$1840))-ROW($A$1), ROWS($M$3:M11))), \"\")","v":""},{"$f":"IFERROR(INDEX($B$2:$B$1840,_xlfn.AGGREGATE(15,3,(($A$2:$A$1840=$N$3)/($A$2:$A$1840=$N$3)*ROW($A$2:$A$1840))-ROW($A$1), ROWS($M$3:M11))), \"\")","v":""},{"$f":"IFERROR(INDEX($J$2:$J$1840,_xlfn.AGGREGATE(15,3,(($A$2:$A$1840=$N$3)/($A$2:$A$1840=$N$3)*ROW($A$2:$A$1840))-ROW($A$1), ROWS($M$3:M11))), \"\")","v":""},{"$f":"IFERROR(INDEX($G$2:$G$1840,_xlfn.AGGREGATE(15,3,(($A$2:$A$1840=$N$3)/($A$2:$A$1840=$N$3)*ROW($A$2:$A$1840))-ROW($A$1), ROWS($M$3:M11))), \"\")","v":""},""]
["0005","Robinson Park","00050025",null,"K - 04","SW",381,null,"ES",156,249.60000000000002,null,null,null,{"$f":"IFERROR((RANK(T12,$T$3:$T$191,0)+COUNTIF($T$3:T12, T12)-1), \"\")","v":""},{"$f":"IFERROR(INDEX($C$2:$C$1840,_xlfn.AGGREGATE(15,3,(($A$2:$A$1840=$N$3)/($A$2:$A$1840=$N$3)*ROW($A$2:$A$1840))-ROW($A$1), ROWS($M$3:M12))), \"\")","v":""},{"$f":"IFERROR(INDEX($B$2:$B$1840,_xlfn.AGGREGATE(15,3,(($A$2:$A$1840=$N$3)/($A$2:$A$1840=$N$3)*ROW($A$2:$A$1840))-ROW($A$1), ROWS($M$3:M12))), \"\")","v":""},{"$f":"IFERROR(INDEX($J$2:$J$1840,_xlfn.AGGREGATE(15,3,(($A$2:$A$1840=$N$3)/($A$2:$A$1840=$N$3)*ROW($A$2:$A$1840))-ROW($A$1), ROWS($M$3:M12))), \"\")","v":""},{"$f":"IFERROR(INDEX($G$2:$G$1840,_xlfn.AGGREGATE(15,3,(($A$2:$A$1840=$N$3)/($A$2:$A$1840=$N$3)*ROW($A$2:$A$1840))-ROW($A$1), ROWS($M$3:M12))), \"\")","v":""},""]
["0005","James Clark School","00050030",null,"K - 04","SW",271,null,"ES",93,148.80000000000001,null,null,null,{"$f":"IFERROR((RANK(T13,$T$3:$T$191,0)+COUNTIF($T$3:T13, T13)-1), \"\")","v":""},{"$f":"IFERROR(INDEX($C$2:$C$1840,_xlfn.AGGREGATE(15,3,(($A$2:$A$1840=$N$3)/($A$2:$A$1840=$N$3)*ROW($A$2:$A$1840))-ROW($A$1), ROWS($M$3:M13))), \"\")","v":""},{"$f":"IFERROR(INDEX($B$2:$B$1840,_xlfn.AGGREGATE(15,3,(($A$2:$A$1840=$N$3)/($A$2:$A$1840=$N$3)*ROW($A$2:$A$1840))-ROW($A$1), ROWS($M$3:M13))), \"\")","v":""},{"$f":"IFERROR(INDEX($J$2:$J$1840,_xlfn.AGGREGATE(15,3,(($A$2:$A$1840=$N$3)/($A$2:$A$1840=$N$3)*ROW($A$2:$A$1840))-ROW($A$1), ROWS($M$3:M13))), \"\")","v":""},{"$f":"IFERROR(INDEX($G$2:$G$1840,_xlfn.AGGREGATE(15,3,(($A$2:$A$1840=$N$3)/($A$2:$A$1840=$N$3)*ROW($A$2:$A$1840))-ROW($A$1), ROWS($M$3:M13))), \"\")","v":""},""]
["0005","Roberta G. Doering School","00050303",null,"05 - 07","NT",521,null,"MS",202,323.20000000000005,null,null,null,{"$f":"IFERROR((RANK(T14,$T$3:$T$191,0)+COUNTIF($T$3:T14, T14)-1), \"\")","v":""},{"$f":"IFERROR(INDEX($C$2:$C$1840,_xlfn.AGGREGATE(15,3,(($A$2:$A$1840=$N$3)/($A$2:$A$1840=$N$3)*ROW($A$2:$A$1840))-ROW($A$1), ROWS($M$3:M14))), \"\")","v":""},{"$f":"IFERROR(INDEX($B$2:$B$1840,_xlfn.AGGREGATE(15,3,(($A$2:$A$1840=$N$3)/($A$2:$A$1840=$N$3)*ROW($A$2:$A$1840))-ROW($A$1), ROWS($M$3:M14))), \"\")","v":""},{"$f":"IFERROR(INDEX($J$2:$J$1840,_xlfn.AGGREGATE(15,3,(($A$2:$A$1840=$N$3)/($A$2:$A$1840=$N$3)*ROW($A$2:$A$1840))-ROW($A$1), ROWS($M$3:M14))), \"\")","v":""},{"$f":"IFERROR(INDEX($G$2:$G$1840,_xlfn.AGGREGATE(15,3,(($A$2:$A$1840=$N$3)/($A$2:$A$1840=$N$3)*ROW($A$2:$A$1840))-ROW($A$1), ROWS($M$3:M14))), \"\")","v":""},""]
["0005","Agawam Junior High","00050405",null,"07 - 08","NT",590,null,"MS",230,368,null,null,null,{"$f":"IFERROR((RANK(T15,$T$3:$T$191,0)+COUNTIF($T$3:T15, T15)-1), \"\")","v":""},{"$f":"IFERROR(INDEX($C$2:$C$1840,_xlfn.AGGREGATE(15,3,(($A$2:$A$1840=$N$3)/($A$2:$A$1840=$N$3)*ROW($A$2:$A$1840))-ROW($A$1), ROWS($M$3:M15))), \"\")","v":""},{"$f":"IFERROR(INDEX($B$2:$B$1840,_xlfn.AGGREGATE(15,3,(($A$2:$A$1840=$N$3)/($A$2:$A$1840=$N$3)*ROW($A$2:$A$1840))-ROW($A$1), ROWS($M$3:M15))), \"\")","v":""},{"$f":"IFERROR(INDEX($J$2:$J$1840,_xlfn.AGGREGATE(15,3,(($A$2:$A$1840=$N$3)/($A$2:$A$1840=$N$3)*ROW($A$2:$A$1840))-ROW($A$1), ROWS($M$3:M15))), \"\")","v":""},{"$f":"IFERROR(INDEX($G$2:$G$1840,_xlfn.AGGREGATE(15,3,(($A$2:$A$1840=$N$3)/($A$2:$A$1840=$N$3)*ROW($A$2:$A$1840))-ROW($A$1), ROWS($M$3:M15))), \"\")","v":""},""]
["0005","Agawam High","00050505",null,"09 - 12","NT",986,null,"HS",291,465.6,null,null,null,{"$f":"IFERROR((RANK(T16,$T$3:$T$191,0)+COUNTIF($T$3:T16, T16)-1), \"\")","v":""},{"$f":"IFERROR(INDEX($C$2:$C$1840,_xlfn.AGGREGATE(15,3,(($A$2:$A$1840=$N$3)/($A$2:$A$1840=$N$3)*ROW($A$2:$A$1840))-ROW($A$1), ROWS($M$3:M16))), \"\")","v":""},{"$f":"IFERROR(INDEX($B$2:$B$1840,_xlfn.AGGREGATE(15,3,(($A$2:$A$1840=$N$3)/($A$2:$A$1840=$N$3)*ROW($A$2:$A$1840))-ROW($A$1), ROWS($M$3:M16))), \"\")","v":""},{"$f":"IFERROR(INDEX($J$2:$J$1840,_xlfn.AGGREGATE(15,3,(($A$2:$A$1840=$N$3)/($A$2:$A$1840=$N$3)*ROW($A$2:$A$1840))-ROW($A$1), ROWS($M$3:M16))), \"\")","v":""},{"$f":"IFERROR(INDEX($G$2:$G$1840,_xlfn.AGGREGATE(15,3,(($A$2:$A$1840=$N$3)/($A$2:$A$1840=$N$3)*ROW($A$2:$A$1840))-ROW($A$1), ROWS($M$3:M16))), \"\")","v":""},""]
["0007","Amesbury Elementary","00070005",null,"PK - 04","TA",309,null,"ES",96,148.80000000000001,null,null,null,{"$f":"IFERROR((RANK(T17,$T$3:$T$191,0)+COUNTIF($T$3:T17, T17)-1), \"\")","v":""},{"$f":"IFERROR(INDEX($C$2:$C$1840,_xlfn.AGGREGATE(15,3,(($A$2:$A$1840=$N$3)/($A$2:$A$1840=$N$3)*ROW($A$2:$A$1840))-ROW($A$1), ROWS($M$3:M17))), \"\")","v":""},{"$f":"IFERROR(INDEX($B$2:$B$1840,_xlfn.AGGREGATE(15,3,(($A$2:$A$1840=$N$3)/($A$2:$A$1840=$N$3)*ROW($A$2:$A$1840))-ROW($A$1), ROWS($M$3:M17))), \"\")","v":""},{"$f":"IFERROR(INDEX($J$2:$J$1840,_xlfn.AGGREGATE(15,3,(($A$2:$A$1840=$N$3)/($A$2:$A$1840=$N$3)*ROW($A$2:$A$1840))-ROW($A$1), ROWS($M$3:M17))), \"\")","v":""},{"$f":"IFERROR(INDEX($G$2:$G$1840,_xlfn.AGGREGATE(15,3,(($A$2:$A$1840=$N$3)/($A$2:$A$1840=$N$3)*ROW($A$2:$A$1840))-ROW($A$1), ROWS($M$3:M17))), \"\")","v":""},""]
["0007","Charles C Cashman Elementary","00070010",null,"PK - 04","TA",347,null,"ES",128,192,null,null,null,{"$f":"IFERROR((RANK(T18,$T$3:$T$191,0)+COUNTIF($T$3:T18, T18)-1), \"\")","v":""},{"$f":"IFERROR(INDEX($C$2:$C$1840,_xlfn.AGGREGATE(15,3,(($A$2:$A$1840=$N$3)/($A$2:$A$1840=$N$3)*ROW($A$2:$A$1840))-ROW($A$1), ROWS($M$3:M18))), \"\")","v":""},{"$f":"IFERROR(INDEX($B$2:$B$1840,_xlfn.AGGREGATE(15,3,(($A$2:$A$1840=$N$3)/($A$2:$A$1840=$N$3)*ROW($A$2:$A$1840))-ROW($A$1), ROWS($M$3:M18))), \"\")","v":""},{"$f":"IFERROR(INDEX($J$2:$J$1840,_xlfn.AGGREGATE(15,3,(($A$2:$A$1840=$N$3)/($A$2:$A$1840=$N$3)*ROW($A$2:$A$1840))-ROW($A$1), ROWS($M$3:M18))), \"\")","v":""},{"$f":"IFERROR(INDEX($G$2:$G$1840,_xlfn.AGGREGATE(15,3,(($A$2:$A$1840=$N$3)/($A$2:$A$1840=$N$3)*ROW($A$2:$A$1840))-ROW($A$1), ROWS($M$3:M18))), \"\")","v":""},""]
["0007","Amesbury Middle","00070013",null,"05 - 08","NT",617,null,"MS",181,289.60000000000002,null,null,null,{"$f":"IFERROR((RANK(T19,$T$3:$T$191,0)+COUNTIF($T$3:T19, T19)-1), \"\")","v":""},{"$f":"IFERROR(INDEX($C$2:$C$1840,_xlfn.AGGREGATE(15,3,(($A$2:$A$1840=$N$3)/($A$2:$A$1840=$N$3)*ROW($A$2:$A$1840))-ROW($A$1), ROWS($M$3:M19))), \"\")","v":""},{"$f":"IFERROR(INDEX($B$2:$B$1840,_xlfn.AGGREGATE(15,3,(($A$2:$A$1840=$N$3)/($A$2:$A$1840=$N$3)*ROW($A$2:$A$1840))-ROW($A$1), ROWS($M$3:M19))), \"\")","v":""},{"$f":"IFERROR(INDEX($J$2:$J$1840,_xlfn.AGGREGATE(15,3,(($A$2:$A$1840=$N$3)/($A$2:$A$1840=$N$3)*ROW($A$2:$A$1840))-ROW($A$1), ROWS($M$3:M19))), \"\")","v":""},{"$f":"IFERROR(INDEX($G$2:$G$1840,_xlfn.AGGREGATE(15,3,(($A$2:$A$1840=$N$3)/($A$2:$A$1840=$N$3)*ROW($A$2:$A$1840))-ROW($A$1), ROWS($M$3:M19))), \"\")","v":""},""]
["0007","Amesbury High","00070505",null,"09 - 12","NT",511,null,"HS",106,161.60000000000002,null,null,null,{"$f":"IFERROR((RANK(T20,$T$3:$T$191,0)+COUNTIF($T$3:T20, T20)-1), \"\")","v":""},{"$f":"IFERROR(INDEX($C$2:$C$1840,_xlfn.AGGREGATE(15,3,(($A$2:$A$1840=$N$3)/($A$2:$A$1840=$N$3)*ROW($A$2:$A$1840))-ROW($A$1), ROWS($M$3:M20))), \"\")","v":""},{"$f":"IFERROR(INDEX($B$2:$B$1840,_xlfn.AGGREGATE(15,3,(($A$2:$A$1840=$N$3)/($A$2:$A$1840=$N$3)*ROW($A$2:$A$1840))-ROW($A$1), ROWS($M$3:M20))), \"\")","v":""},{"$f":"IFERROR(INDEX($J$2:$J$1840,_xlfn.AGGREGATE(15,3,(($A$2:$A$1840=$N$3)/($A$2:$A$1840=$N$3)*ROW($A$2:$A$1840))-ROW($A$1), ROWS($M$3:M20))), \"\")","v":""},{"$f":"IFERROR(INDEX($G$2:$G$1840,_xlfn.AGGREGATE(15,3,(($A$2:$A$1840=$N$3)/($A$2:$A$1840=$N$3)*ROW($A$2:$A$1840))-ROW($A$1), ROWS($M$3:M20))), \"\")","v":""},""]
["0007","Amesbury Innovation High School","00070515",null,"09 - 12","NT",43,null,"HS",25,40,null,null,null,{"$f":"IFERROR((RANK(T21,$T$3:$T$191,0)+COUNTIF($T$3:T21, T21)-1), \"\")","v":""},{"$f":"IFERROR(INDEX($C$2:$C$1840,_xlfn.AGGREGATE(15,3,(($A$2:$A$1840=$N$3)/($A$2:$A$1840=$N$3)*ROW($A$2:$A$1840))-ROW($A$1), ROWS($M$3:M21))), \"\")","v":""},{"$f":"IFERROR(INDEX($B$2:$B$1840,_xlfn.AGGREGATE(15,3,(($A$2:$A$1840=$N$3)/($A$2:$A$1840=$N$3)*ROW($A$2:$A$1840))-ROW($A$1), ROWS($M$3:M21))), \"\")","v":""},{"$f":"IFERROR(INDEX($J$2:$J$1840,_xlfn.AGGREGATE(15,3,(($A$2:$A$1840=$N$3)/($A$2:$A$1840=$N$3)*ROW($A$2:$A$1840))-ROW($A$1), ROWS($M$3:M21))), \"\")","v":""},{"$f":"IFERROR(INDEX($G$2:$G$1840,_xlfn.AGGREGATE(15,3,(($A$2:$A$1840=$N$3)/($A$2:$A$1840=$N$3)*ROW($A$2:$A$1840))-ROW($A$1), ROWS($M$3:M21))), \"\")","v":""},""]
["0008","Crocker Farm Elementary","00080009",null,"PK - 06","TA",347,null,"ES",109,142.4,null,null,null,{"$f":"IFERROR((RANK(T22,$T$3:$T$191,0)+COUNTIF($T$3:T22, T22)-1), \"\")","v":""},{"$f":"IFERROR(INDEX($C$2:$C$1840,_xlfn.AGGREGATE(15,3,(($A$2:$A$1840=$N$3)/($A$2:$A$1840=$N$3)*ROW($A$2:$A$1840))-ROW($A$1), ROWS($M$3:M22))), \"\")","v":""},{"$f":"IFERROR(INDEX($B$2:$B$1840,_xlfn.AGGREGATE(15,3,(($A$2:$A$1840=$N$3)/($A$2:$A$1840=$N$3)*ROW($A$2:$A$1840))-ROW($A$1), ROWS($M$3:M22))), \"\")","v":""},{"$f":"IFERROR(INDEX($J$2:$J$1840,_xlfn.AGGREGATE(15,3,(($A$2:$A$1840=$N$3)/($A$2:$A$1840=$N$3)*ROW($A$2:$A$1840))-ROW($A$1), ROWS($M$3:M22))), \"\")","v":""},{"$f":"IFERROR(INDEX($G$2:$G$1840,_xlfn.AGGREGATE(15,3,(($A$2:$A$1840=$N$3)/($A$2:$A$1840=$N$3)*ROW($A$2:$A$1840))-ROW($A$1), ROWS($M$3:M22))), \"\")","v":""},""]
["0008","Fort River Elementary","00080020",null,"K - 06","TA",304,null,"ES",112,179.20000000000002,null,null,null,{"$f":"IFERROR((RANK(T23,$T$3:$T$191,0)+COUNTIF($T$3:T23, T23)-1), \"\")","v":""},{"$f":"IFERROR(INDEX($C$2:$C$1840,_xlfn.AGGREGATE(15,3,(($A$2:$A$1840=$N$3)/($A$2:$A$1840=$N$3)*ROW($A$2:$A$1840))-ROW($A$1), ROWS($M$3:M23))), \"\")","v":""},{"$f":"IFERROR(INDEX($B$2:$B$1840,_xlfn.AGGREGATE(15,3,(($A$2:$A$1840=$N$3)/($A$2:$A$1840=$N$3)*ROW($A$2:$A$1840))-ROW($A$1), ROWS($M$3:M23))), \"\")","v":""},{"$f":"IFERROR(INDEX($J$2:$J$1840,_xlfn.AGGREGATE(15,3,(($A$2:$A$1840=$N$3)/($A$2:$A$1840=$N$3)*ROW($A$2:$A$1840))-ROW($A$1), ROWS($M$3:M23))), \"\")","v":""},{"$f":"IFERROR(INDEX($G$2:$G$1840,_xlfn.AGGREGATE(15,3,(($A$2:$A$1840=$N$3)/($A$2:$A$1840=$N$3)*ROW($A$2:$A$1840))-ROW($A$1), ROWS($M$3:M23))), \"\")","v":""},""]
["0008","Wildwood Elementary","00080050",null,"K - 06","TA",355,null,"ES",124,198.4,null,null,null,{"$f":"IFERROR((RANK(T24,$T$3:$T$191,0)+COUNTIF($T$3:T24, T24)-1), \"\")","v":""},{"$f":"IFERROR(INDEX($C$2:$C$1840,_xlfn.AGGREGATE(15,3,(($A$2:$A$1840=$N$3)/($A$2:$A$1840=$N$3)*ROW($A$2:$A$1840))-ROW($A$1), ROWS($M$3:M24))), \"\")","v":""},{"$f":"IFERROR(INDEX($B$2:$B$1840,_xlfn.AGGREGATE(15,3,(($A$2:$A$1840=$N$3)/($A$2:$A$1840=$N$3)*ROW($A$2:$A$1840))-ROW($A$1), ROWS($M$3:M24))), \"\")","v":""},{"$f":"IFERROR(INDEX($J$2:$J$1840,_xlfn.AGGREGATE(15,3,(($A$2:$A$1840=$N$3)/($A$2:$A$1840=$N$3)*ROW($A$2:$A$1840))-ROW($A$1), ROWS($M$3:M24))), \"\")","v":""},{"$f":"IFERROR(INDEX($G$2:$G$1840,_xlfn.AGGREGATE(15,3,(($A$2:$A$1840=$N$3)/($A$2:$A$1840=$N$3)*ROW($A$2:$A$1840))-ROW($A$1), ROWS($M$3:M24))), \"\")","v":""},""]
["0009","Bancroft Elementary","00090003",null,"K - 05","TA",520,null,"ES",42,67.2,null,null,null,{"$f":"IFERROR((RANK(T25,$T$3:$T$191,0)+COUNTIF($T$3:T25, T25)-1), \"\")","v":""},{"$f":"IFERROR(INDEX($C$2:$C$1840,_xlfn.AGGREGATE(15,3,(($A$2:$A$1840=$N$3)/($A$2:$A$1840=$N$3)*ROW($A$2:$A$1840))-ROW($A$1), ROWS($M$3:M25))), \"\")","v":""},{"$f":"IFERROR(INDEX($B$2:$B$1840,_xlfn.AGGREGATE(15,3,(($A$2:$A$1840=$N$3)/($A$2:$A$1840=$N$3)*ROW($A$2:$A$1840))-ROW($A$1), ROWS($M$3:M25))), \"\")","v":""},{"$f":"IFERROR(INDEX($J$2:$J$1840,_xlfn.AGGREGATE(15,3,(($A$2:$A$1840=$N$3)/($A$2:$A$1840=$N$3)*ROW($A$2:$A$1840))-ROW($A$1), ROWS($M$3:M25))), \"\")","v":""},{"$f":"IFERROR(INDEX($G$2:$G$1840,_xlfn.AGGREGATE(15,3,(($A$2:$A$1840=$N$3)/($A$2:$A$1840=$N$3)*ROW($A$2:$A$1840))-ROW($A$1), ROWS($M$3:M25))), \"\")","v":""},""]
["0009","High Plain Elementary","00090004",null,"K - 05","TA",513,null,"ES",52,83.2,null,null,null,{"$f":"IFERROR((RANK(T26,$T$3:$T$191,0)+COUNTIF($T$3:T26, T26)-1), \"\")","v":""},{"$f":"IFERROR(INDEX($C$2:$C$1840,_xlfn.AGGREGATE(15,3,(($A$2:$A$1840=$N$3)/($A$2:$A$1840=$N$3)*ROW($A$2:$A$1840))-ROW($A$1), ROWS($M$3:M26))), \"\")","v":""},{"$f":"IFERROR(INDEX($B$2:$B$1840,_xlfn.AGGREGATE(15,3,(($A$2:$A$1840=$N$3)/($A$2:$A$1840=$N$3)*ROW($A$2:$A$1840))-ROW($A$1), ROWS($M$3:M26))), \"\")","v":""},{"$f":"IFERROR(INDEX($J$2:$J$1840,_xlfn.AGGREGATE(15,3,(($A$2:$A$1840=$N$3)/($A$2:$A$1840=$N$3)*ROW($A$2:$A$1840))-ROW($A$1), ROWS($M$3:M26))), \"\")","v":""},{"$f":"IFERROR(INDEX($G$2:$G$1840,_xlfn.AGGREGATE(15,3,(($A$2:$A$1840=$N$3)/($A$2:$A$1840=$N$3)*ROW($A$2:$A$1840))-ROW($A$1), ROWS($M$3:M26))), \"\")","v":""},""]
["0009","Shawsheen School","00090005",null,"PK","NT",73,null,"EES",12,0,null,null,null,{"$f":"IFERROR((RANK(T27,$T$3:$T$191,0)+COUNTIF($T$3:T27, T27)-1), \"\")","v":""},{"$f":"IFERROR(INDEX($C$2:$C$1840,_xlfn.AGGREGATE(15,3,(($A$2:$A$1840=$N$3)/($A$2:$A$1840=$N$3)*ROW($A$2:$A$1840))-ROW($A$1), ROWS($M$3:M27))), \"\")","v":""},{"$f":"IFERROR(INDEX($B$2:$B$1840,_xlfn.AGGREGATE(15,3,(($A$2:$A$1840=$N$3)/($A$2:$A$1840=$N$3)*ROW($A$2:$A$1840))-ROW($A$1), ROWS($M$3:M27))), \"\")","v":""},{"$f":"IFERROR(INDEX($J$2:$J$1840,_xlfn.AGGREGATE(15,3,(($A$2:$A$1840=$N$3)/($A$2:$A$1840=$N$3)*ROW($A$2:$A$1840))-ROW($A$1), ROWS($M$3:M27))), \"\")","v":""},{"$f":"IFERROR(INDEX($G$2:$G$1840,_xlfn.AGGREGATE(15,3,(($A$2:$A$1840=$N$3)/($A$2:$A$1840=$N$3)*ROW($A$2:$A$1840))-ROW($A$1), ROWS($M$3:M27))), \"\")","v":""},""]
["0009","Henry C Sanborn Elementary","00090010",null,"K - 05","TA",336,null,"ES",34,54.400000000000006,null,null,null,{"$f":"IFERROR((RANK(T28,$T$3:$T$191,0)+COUNTIF($T$3:T28, T28)-1), \"\")","v":""},{"$f":"IFERROR(INDEX($C$2:$C$1840,_xlfn.AGGREGATE(15,3,(($A$2:$A$1840=$N$3)/($A$2:$A$1840=$N$3)*ROW($A$2:$A$1840))-ROW($A$1), ROWS($M$3:M28))), \"\")","v":""},{"$f":"IFERROR(INDEX($B$2:$B$1840,_xlfn.AGGREGATE(15,3,(($A$2:$A$1840=$N$3)/($A$2:$A$1840=$N$3)*ROW($A$2:$A$1840))-ROW($A$1), ROWS($M$3:M28))), \"\")","v":""},{"$f":"IFERROR(INDEX($J$2:$J$1840,_xlfn.AGGREGATE(15,3,(($A$2:$A$1840=$N$3)/($A$2:$A$1840=$N$3)*ROW($A$2:$A$1840))-ROW($A$1), ROWS($M$3:M28))), \"\")","v":""},{"$f":"IFERROR(INDEX($G$2:$G$1840,_xlfn.AGGREGATE(15,3,(($A$2:$A$1840=$N$3)/($A$2:$A$1840=$N$3)*ROW($A$2:$A$1840))-ROW($A$1), ROWS($M$3:M28))), \"\")","v":""},""]
["0009","South Elementary","00090020",null,"K - 05","NT",463,null,"ES",42,67.2,null,null,null,{"$f":"IFERROR((RANK(T29,$T$3:$T$191,0)+COUNTIF($T$3:T29, T29)-1), \"\")","v":""},{"$f":"IFERROR(INDEX($C$2:$C$1840,_xlfn.AGGREGATE(15,3,(($A$2:$A$1840=$N$3)/($A$2:$A$1840=$N$3)*ROW($A$2:$A$1840))-ROW($A$1), ROWS($M$3:M29))), \"\")","v":""},{"$f":"IFERROR(INDEX($B$2:$B$1840,_xlfn.AGGREGATE(15,3,(($A$2:$A$1840=$N$3)/($A$2:$A$1840=$N$3)*ROW($A$2:$A$1840))-ROW($A$1), ROWS($M$3:M29))), \"\")","v":""},{"$f":"IFERROR(INDEX($J$2:$J$1840,_xlfn.AGGREGATE(15,3,(($A$2:$A$1840=$N$3)/($A$2:$A$1840=$N$3)*ROW($A$2:$A$1840))-ROW($A$1), ROWS($M$3:M29))), \"\")","v":""},{"$f":"IFERROR(INDEX($G$2:$G$1840,_xlfn.AGGREGATE(15,3,(($A$2:$A$1840=$N$3)/($A$2:$A$1840=$N$3)*ROW($A$2:$A$1840))-ROW($A$1), ROWS($M$3:M29))), \"\")","v":""},""]
["0009","West Elementary","00090025",null,"K - 05","TA",540,null,"ES",54,86.4,null,null,null,{"$f":"IFERROR((RANK(T30,$T$3:$T$191,0)+COUNTIF($T$3:T30, T30)-1), \"\")","v":""},{"$f":"IFERROR(INDEX($C$2:$C$1840,_xlfn.AGGREGATE(15,3,(($A$2:$A$1840=$N$3)/($A$2:$A$1840=$N$3)*ROW($A$2:$A$1840))-ROW($A$1), ROWS($M$3:M30))), \"\")","v":""},{"$f":"IFERROR(INDEX($B$2:$B$1840,_xlfn.AGGREGATE(15,3,(($A$2:$A$1840=$N$3)/($A$2:$A$1840=$N$3)*ROW($A$2:$A$1840))-ROW($A$1), ROWS($M$3:M30))), \"\")","v":""},{"$f":"IFERROR(INDEX($J$2:$J$1840,_xlfn.AGGREGATE(15,3,(($A$2:$A$1840=$N$3)/($A$2:$A$1840=$N$3)*ROW($A$2:$A$1840))-ROW($A$1), ROWS($M$3:M30))), \"\")","v":""},{"$f":"IFERROR(INDEX($G$2:$G$1840,_xlfn.AGGREGATE(15,3,(($A$2:$A$1840=$N$3)/($A$2:$A$1840=$N$3)*ROW($A$2:$A$1840))-ROW($A$1), ROWS($M$3:M30))), \"\")","v":""},""]
["0009","Doherty Middle","00090305",null,"06 - 08","TA",468,null,"MS",38,60.800000000000004,null,null,null,{"$f":"IFERROR((RANK(T31,$T$3:$T$191,0)+COUNTIF($T$3:T31, T31)-1), \"\")","v":""},{"$f":"IFERROR(INDEX($C$2:$C$1840,_xlfn.AGGREGATE(15,3,(($A$2:$A$1840=$N$3)/($A$2:$A$1840=$N$3)*ROW($A$2:$A$1840))-ROW($A$1), ROWS($M$3:M31))), \"\")","v":""},{"$f":"IFERROR(INDEX($B$2:$B$1840,_xlfn.AGGREGATE(15,3,(($A$2:$A$1840=$N$3)/($A$2:$A$1840=$N$3)*ROW($A$2:$A$1840))-ROW($A$1), ROWS($M$3:M31))), \"\")","v":""},{"$f":"IFERROR(INDEX($J$2:$J$1840,_xlfn.AGGREGATE(15,3,(($A$2:$A$1840=$N$3)/($A$2:$A$1840=$N$3)*ROW($A$2:$A$1840))-ROW($A$1), ROWS($M$3:M31))), \"\")","v":""},{"$f":"IFERROR(INDEX($G$2:$G$1840,_xlfn.AGGREGATE(15,3,(($A$2:$A$1840=$N$3)/($A$2:$A$1840=$N$3)*ROW($A$2:$A$1840))-ROW($A$1), ROWS($M$3:M31))), \"\")","v":""},""]
["0009","Andover West Middle","00090310",null,"06 - 08","TA",539,null,"MS",74,118.4,null,null,null,{"$f":"IFERROR((RANK(T32,$T$3:$T$191,0)+COUNTIF($T$3:T32, T32)-1), \"\")","v":""},{"$f":"IFERROR(INDEX($C$2:$C$1840,_xlfn.AGGREGATE(15,3,(($A$2:$A$1840=$N$3)/($A$2:$A$1840=$N$3)*ROW($A$2:$A$1840))-ROW($A$1), ROWS($M$3:M32))), \"\")","v":""},{"$f":"IFERROR(INDEX($B$2:$B$1840,_xlfn.AGGREGATE(15,3,(($A$2:$A$1840=$N$3)/($A$2:$A$1840=$N$3)*ROW($A$2:$A$1840))-ROW($A$1), ROWS($M$3:M32))), \"\")","v":""},{"$f":"IFERROR(INDEX($J$2:$J$1840,_xlfn.AGGREGATE(15,3,(($A$2:$A$1840=$N$3)/($A$2:$A$1840=$N$3)*ROW($A$2:$A$1840))-ROW($A$1), ROWS($M$3:M32))), \"\")","v":""},{"$f":"IFERROR(INDEX($G$2:$G$1840,_xlfn.AGGREGATE(15,3,(($A$2:$A$1840=$N$3)/($A$2:$A$1840=$N$3)*ROW($A$2:$A$1840))-ROW($A$1), ROWS($M$3:M32))), \"\")","v":""},""]
["0009","Wood Hill Middle School","00090350",null,"06 - 08","TA",374,null,"MS",28,44.800000000000004,null,null,null,{"$f":"IFERROR((RANK(T33,$T$3:$T$191,0)+COUNTIF($T$3:T33, T33)-1), \"\")","v":""},{"$f":"IFERROR(INDEX($C$2:$C$1840,_xlfn.AGGREGATE(15,3,(($A$2:$A$1840=$N$3)/($A$2:$A$1840=$N$3)*ROW($A$2:$A$1840))-ROW($A$1), ROWS($M$3:M33))), \"\")","v":""},{"$f":"IFERROR(INDEX($B$2:$B$1840,_xlfn.AGGREGATE(15,3,(($A$2:$A$1840=$N$3)/($A$2:$A$1840=$N$3)*ROW($A$2:$A$1840))-ROW($A$1), ROWS($M$3:M33))), \"\")","v":""},{"$f":"IFERROR(INDEX($J$2:$J$1840,_xlfn.AGGREGATE(15,3,(($A$2:$A$1840=$N$3)/($A$2:$A$1840=$N$3)*ROW($A$2:$A$1840))-ROW($A$1), ROWS($M$3:M33))), \"\")","v":""},{"$f":"IFERROR(INDEX($G$2:$G$1840,_xlfn.AGGREGATE(15,3,(($A$2:$A$1840=$N$3)/($A$2:$A$1840=$N$3)*ROW($A$2:$A$1840))-ROW($A$1), ROWS($M$3:M33))), \"\")","v":""},""]
["0009","Andover High","00090505",null,"09 - 12","NT",1746,null,"HS",200,289.60000000000002,null,null,null,{"$f":"IFERROR((RANK(T34,$T$3:$T$191,0)+COUNTIF($T$3:T34, T34)-1), \"\")","v":""},{"$f":"IFERROR(INDEX($C$2:$C$1840,_xlfn.AGGREGATE(15,3,(($A$2:$A$1840=$N$3)/($A$2:$A$1840=$N$3)*ROW($A$2:$A$1840))-ROW($A$1), ROWS($M$3:M34))), \"\")","v":""},{"$f":"IFERROR(INDEX($B$2:$B$1840,_xlfn.AGGREGATE(15,3,(($A$2:$A$1840=$N$3)/($A$2:$A$1840=$N$3)*ROW($A$2:$A$1840))-ROW($A$1), ROWS($M$3:M34))), \"\")","v":""},{"$f":"IFERROR(INDEX($J$2:$J$1840,_xlfn.AGGREGATE(15,3,(($A$2:$A$1840=$N$3)/($A$2:$A$1840=$N$3)*ROW($A$2:$A$1840))-ROW($A$1), ROWS($M$3:M34))), \"\")","v":""},{"$f":"IFERROR(INDEX($G$2:$G$1840,_xlfn.AGGREGATE(15,3,(($A$2:$A$1840=$N$3)/($A$2:$A$1840=$N$3)*ROW($A$2:$A$1840))-ROW($A$1), ROWS($M$3:M34))), \"\")","v":""},""]
["0010","John A Bishop","00100005",null,"K - 05","NT",371,null,"ES",17,27.200000000000003,null,null,null,{"$f":"IFERROR((RANK(T35,$T$3:$T$191,0)+COUNTIF($T$3:T35, T35)-1), \"\")","v":""},{"$f":"IFERROR(INDEX($C$2:$C$1840,_xlfn.AGGREGATE(15,3,(($A$2:$A$1840=$N$3)/($A$2:$A$1840=$N$3)*ROW($A$2:$A$1840))-ROW($A$1), ROWS($M$3:M35))), \"\")","v":""},{"$f":"IFERROR(INDEX($B$2:$B$1840,_xlfn.AGGREGATE(15,3,(($A$2:$A$1840=$N$3)/($A$2:$A$1840=$N$3)*ROW($A$2:$A$1840))-ROW($A$1), ROWS($M$3:M35))), \"\")","v":""},{"$f":"IFERROR(INDEX($J$2:$J$1840,_xlfn.AGGREGATE(15,3,(($A$2:$A$1840=$N$3)/($A$2:$A$1840=$N$3)*ROW($A$2:$A$1840))-ROW($A$1), ROWS($M$3:M35))), \"\")","v":""},{"$f":"IFERROR(INDEX($G$2:$G$1840,_xlfn.AGGREGATE(15,3,(($A$2:$A$1840=$N$3)/($A$2:$A$1840=$N$3)*ROW($A$2:$A$1840))-ROW($A$1), ROWS($M$3:M35))), \"\")","v":""},""]
["0010","Brackett","00100010",null,"K - 05","NT",459,null,"ES",12,19.200000000000003,null,null,null,{"$f":"IFERROR((RANK(T36,$T$3:$T$191,0)+COUNTIF($T$3:T36, T36)-1), \"\")","v":""},{"$f":"IFERROR(INDEX($C$2:$C$1840,_xlfn.AGGREGATE(15,3,(($A$2:$A$1840=$N$3)/($A$2:$A$1840=$N$3)*ROW($A$2:$A$1840))-ROW($A$1), ROWS($M$3:M36))), \"\")","v":""},{"$f":"IFERROR(INDEX($B$2:$B$1840,_xlfn.AGGREGATE(15,3,(($A$2:$A$1840=$N$3)/($A$2:$A$1840=$N$3)*ROW($A$2:$A$1840))-ROW($A$1), ROWS($M$3:M36))), \"\")","v":""},{"$f":"IFERROR(INDEX($J$2:$J$1840,_xlfn.AGGREGATE(15,3,(($A$2:$A$1840=$N$3)/($A$2:$A$1840=$N$3)*ROW($A$2:$A$1840))-ROW($A$1), ROWS($M$3:M36))), \"\")","v":""},{"$f":"IFERROR(INDEX($G$2:$G$1840,_xlfn.AGGREGATE(15,3,(($A$2:$A$1840=$N$3)/($A$2:$A$1840=$N$3)*ROW($A$2:$A$1840))-ROW($A$1), ROWS($M$3:M36))), \"\")","v":""},""]
["0010","Cyrus E Dallin","00100025",null,"K - 05","NT",425,null,"ES",29,46.400000000000006,null,null,null,{"$f":"IFERROR((RANK(T37,$T$3:$T$191,0)+COUNTIF($T$3:T37, T37)-1), \"\")","v":""},{"$f":"IFERROR(INDEX($C$2:$C$1840,_xlfn.AGGREGATE(15,3,(($A$2:$A$1840=$N$3)/($A$2:$A$1840=$N$3)*ROW($A$2:$A$1840))-ROW($A$1), ROWS($M$3:M37))), \"\")","v":""},{"$f":"IFERROR(INDEX($B$2:$B$1840,_xlfn.AGGREGATE(15,3,(($A$2:$A$1840=$N$3)/($A$2:$A$1840=$N$3)*ROW($A$2:$A$1840))-ROW($A$1), ROWS($M$3:M37))), \"\")","v":""},{"$f":"IFERROR(INDEX($J$2:$J$1840,_xlfn.AGGREGATE(15,3,(($A$2:$A$1840=$N$3)/($A$2:$A$1840=$N$3)*ROW($A$2:$A$1840))-ROW($A$1), ROWS($M$3:M37))), \"\")","v":""},{"$f":"IFERROR(INDEX($G$2:$G$1840,_xlfn.AGGREGATE(15,3,(($A$2:$A$1840=$N$3)/($A$2:$A$1840=$N$3)*ROW($A$2:$A$1840))-ROW($A$1), ROWS($M$3:M37))), \"\")","v":""},""]
["0010","Hardy","00100030",null,"K - 05","NT",404,null,"ES",35,56,null,null,null,{"$f":"IFERROR((RANK(T38,$T$3:$T$191,0)+COUNTIF($T$3:T38, T38)-1), \"\")","v":""},{"$f":"IFERROR(INDEX($C$2:$C$1840,_xlfn.AGGREGATE(15,3,(($A$2:$A$1840=$N$3)/($A$2:$A$1840=$N$3)*ROW($A$2:$A$1840))-ROW($A$1), ROWS($M$3:M38))), \"\")","v":""},{"$f":"IFERROR(INDEX($B$2:$B$1840,_xlfn.AGGREGATE(15,3,(($A$2:$A$1840=$N$3)/($A$2:$A$1840=$N$3)*ROW($A$2:$A$1840))-ROW($A$1), ROWS($M$3:M38))), \"\")","v":""},{"$f":"IFERROR(INDEX($J$2:$J$1840,_xlfn.AGGREGATE(15,3,(($A$2:$A$1840=$N$3)/($A$2:$A$1840=$N$3)*ROW($A$2:$A$1840))-ROW($A$1), ROWS($M$3:M38))), \"\")","v":""},{"$f":"IFERROR(INDEX($G$2:$G$1840,_xlfn.AGGREGATE(15,3,(($A$2:$A$1840=$N$3)/($A$2:$A$1840=$N$3)*ROW($A$2:$A$1840))-ROW($A$1), ROWS($M$3:M38))), \"\")","v":""},""]
["0010","Menotomy Preschool","00100038",null,"PK","NT",76,null,"EES",16,0,null,null,null,{"$f":"IFERROR((RANK(T39,$T$3:$T$191,0)+COUNTIF($T$3:T39, T39)-1), \"\")","v":""},{"$f":"IFERROR(INDEX($C$2:$C$1840,_xlfn.AGGREGATE(15,3,(($A$2:$A$1840=$N$3)/($A$2:$A$1840=$N$3)*ROW($A$2:$A$1840))-ROW($A$1), ROWS($M$3:M39))), \"\")","v":""},{"$f":"IFERROR(INDEX($B$2:$B$1840,_xlfn.AGGREGATE(15,3,(($A$2:$A$1840=$N$3)/($A$2:$A$1840=$N$3)*ROW($A$2:$A$1840))-ROW($A$1), ROWS($M$3:M39))), \"\")","v":""},{"$f":"IFERROR(INDEX($J$2:$J$1840,_xlfn.AGGREGATE(15,3,(($A$2:$A$1840=$N$3)/($A$2:$A$1840=$N$3)*ROW($A$2:$A$1840))-ROW($A$1), ROWS($M$3:M39))), \"\")","v":""},{"$f":"IFERROR(INDEX($G$2:$G$1840,_xlfn.AGGREGATE(15,3,(($A$2:$A$1840=$N$3)/($A$2:$A$1840=$N$3)*ROW($A$2:$A$1840))-ROW($A$1), ROWS($M$3:M39))), \"\")","v":""},""]
["0010","Peirce","00100045",null,"K - 05","TA",303,null,"ES",23,36.800000000000004,null,null,null,{"$f":"IFERROR((RANK(T40,$T$3:$T$191,0)+COUNTIF($T$3:T40, T40)-1), \"\")","v":""},{"$f":"IFERROR(INDEX($C$2:$C$1840,_xlfn.AGGREGATE(15,3,(($A$2:$A$1840=$N$3)/($A$2:$A$1840=$N$3)*ROW($A$2:$A$1840))-ROW($A$1), ROWS($M$3:M40))), \"\")","v":""},{"$f":"IFERROR(INDEX($B$2:$B$1840,_xlfn.AGGREGATE(15,3,(($A$2:$A$1840=$N$3)/($A$2:$A$1840=$N$3)*ROW($A$2:$A$1840))-ROW($A$1), ROWS($M$3:M40))), \"\")","v":""},{"$f":"IFERROR(INDEX($J$2:$J$1840,_xlfn.AGGREGATE(15,3,(($A$2:$A$1840=$N$3)/($A$2:$A$1840=$N$3)*ROW($A$2:$A$1840))-ROW($A$1), ROWS($M$3:M40))), \"\")","v":""},{"$f":"IFERROR(INDEX($G$2:$G$1840,_xlfn.AGGREGATE(15,3,(($A$2:$A$1840=$N$3)/($A$2:$A$1840=$N$3)*ROW($A$2:$A$1840))-ROW($A$1), ROWS($M$3:M40))), \"\")","v":""},""]
["0010","Thompson","00100050",null,"K - 05","TA",483,null,"ES",83,132.80000000000001,null,null,null,{"$f":"IFERROR((RANK(T41,$T$3:$T$191,0)+COUNTIF($T$3:T41, T41)-1), \"\")","v":""},{"$f":"IFERROR(INDEX($C$2:$C$1840,_xlfn.AGGREGATE(15,3,(($A$2:$A$1840=$N$3)/($A$2:$A$1840=$N$3)*ROW($A$2:$A$1840))-ROW($A$1), ROWS($M$3:M41))), \"\")","v":""},{"$f":"IFERROR(INDEX($B$2:$B$1840,_xlfn.AGGREGATE(15,3,(($A$2:$A$1840=$N$3)/($A$2:$A$1840=$N$3)*ROW($A$2:$A$1840))-ROW($A$1), ROWS($M$3:M41))), \"\")","v":""},{"$f":"IFERROR(INDEX($J$2:$J$1840,_xlfn.AGGREGATE(15,3,(($A$2:$A$1840=$N$3)/($A$2:$A$1840=$N$3)*ROW($A$2:$A$1840))-ROW($A$1), ROWS($M$3:M41))), \"\")","v":""},{"$f":"IFERROR(INDEX($G$2:$G$1840,_xlfn.AGGREGATE(15,3,(($A$2:$A$1840=$N$3)/($A$2:$A$1840=$N$3)*ROW($A$2:$A$1840))-ROW($A$1), ROWS($M$3:M41))), \"\")","v":""},""]
["0010","M Norcross Stratton","00100055",null,"K - 05","TA",435,null,"ES",40,64,null,null,null,{"$f":"IFERROR((RANK(T42,$T$3:$T$191,0)+COUNTIF($T$3:T42, T42)-1), \"\")","v":""},{"$f":"IFERROR(INDEX($C$2:$C$1840,_xlfn.AGGREGATE(15,3,(($A$2:$A$1840=$N$3)/($A$2:$A$1840=$N$3)*ROW($A$2:$A$1840))-ROW($A$1), ROWS($M$3:M42))), \"\")","v":""},{"$f":"IFERROR(INDEX($B$2:$B$1840,_xlfn.AGGREGATE(15,3,(($A$2:$A$1840=$N$3)/($A$2:$A$1840=$N$3)*ROW($A$2:$A$1840))-ROW($A$1), ROWS($M$3:M42))), \"\")","v":""},{"$f":"IFERROR(INDEX($J$2:$J$1840,_xlfn.AGGREGATE(15,3,(($A$2:$A$1840=$N$3)/($A$2:$A$1840=$N$3)*ROW($A$2:$A$1840))-ROW($A$1), ROWS($M$3:M42))), \"\")","v":""},{"$f":"IFERROR(INDEX($G$2:$G$1840,_xlfn.AGGREGATE(15,3,(($A$2:$A$1840=$N$3)/($A$2:$A$1840=$N$3)*ROW($A$2:$A$1840))-ROW($A$1), ROWS($M$3:M42))), \"\")","v":""},""]
["0010","Gibbs School","00100305",null,"06","NT",481,null,"MS",51,81.600000000000009,null,null,null,{"$f":"IFERROR((RANK(T43,$T$3:$T$191,0)+COUNTIF($T$3:T43, T43)-1), \"\")","v":""},{"$f":"IFERROR(INDEX($C$2:$C$1840,_xlfn.AGGREGATE(15,3,(($A$2:$A$1840=$N$3)/($A$2:$A$1840=$N$3)*ROW($A$2:$A$1840))-ROW($A$1), ROWS($M$3:M43))), \"\")","v":""},{"$f":"IFERROR(INDEX($B$2:$B$1840,_xlfn.AGGREGATE(15,3,(($A$2:$A$1840=$N$3)/($A$2:$A$1840=$N$3)*ROW($A$2:$A$1840))-ROW($A$1), ROWS($M$3:M43))), \"\")","v":""},{"$f":"IFERROR(INDEX($J$2:$J$1840,_xlfn.AGGREGATE(15,3,(($A$2:$A$1840=$N$3)/($A$2:$A$1840=$N$3)*ROW($A$2:$A$1840))-ROW($A$1), ROWS($M$3:M43))), \"\")","v":""},{"$f":"IFERROR(INDEX($G$2:$G$1840,_xlfn.AGGREGATE(15,3,(($A$2:$A$1840=$N$3)/($A$2:$A$1840=$N$3)*ROW($A$2:$A$1840))-ROW($A$1), ROWS($M$3:M43))), \"\")","v":""},""]
["0010","Ottoson Middle","00100410",null,"07 - 08","NT",883,null,"MS",98,156.80000000000001,null,null,null,{"$f":"IFERROR((RANK(T44,$T$3:$T$191,0)+COUNTIF($T$3:T44, T44)-1), \"\")","v":""},{"$f":"IFERROR(INDEX($C$2:$C$1840,_xlfn.AGGREGATE(15,3,(($A$2:$A$1840=$N$3)/($A$2:$A$1840=$N$3)*ROW($A$2:$A$1840))-ROW($A$1), ROWS($M$3:M44))), \"\")","v":""},{"$f":"IFERROR(INDEX($B$2:$B$1840,_xlfn.AGGREGATE(15,3,(($A$2:$A$1840=$N$3)/($A$2:$A$1840=$N$3)*ROW($A$2:$A$1840))-ROW($A$1), ROWS($M$3:M44))), \"\")","v":""},{"$f":"IFERROR(INDEX($J$2:$J$1840,_xlfn.AGGREGATE(15,3,(($A$2:$A$1840=$N$3)/($A$2:$A$1840=$N$3)*ROW($A$2:$A$1840))-ROW($A$1), ROWS($M$3:M44))), \"\")","v":""},{"$f":"IFERROR(INDEX($G$2:$G$1840,_xlfn.AGGREGATE(15,3,(($A$2:$A$1840=$N$3)/($A$2:$A$1840=$N$3)*ROW($A$2:$A$1840))-ROW($A$1), ROWS($M$3:M44))), \"\")","v":""},""]
["0010","Arlington High","00100505",null,"09 - 12","NT",1405,null,"HS",141,225.60000000000002,null,null,null,{"$f":"IFERROR((RANK(T45,$T$3:$T$191,0)+COUNTIF($T$3:T45, T45)-1), \"\")","v":""},{"$f":"IFERROR(INDEX($C$2:$C$1840,_xlfn.AGGREGATE(15,3,(($A$2:$A$1840=$N$3)/($A$2:$A$1840=$N$3)*ROW($A$2:$A$1840))-ROW($A$1), ROWS($M$3:M45))), \"\")","v":""},{"$f":"IFERROR(INDEX($B$2:$B$1840,_xlfn.AGGREGATE(15,3,(($A$2:$A$1840=$N$3)/($A$2:$A$1840=$N$3)*ROW($A$2:$A$1840))-ROW($A$1), ROWS($M$3:M45))), \"\")","v":""},{"$f":"IFERROR(INDEX($J$2:$J$1840,_xlfn.AGGREGATE(15,3,(($A$2:$A$1840=$N$3)/($A$2:$A$1840=$N$3)*ROW($A$2:$A$1840))-ROW($A$1), ROWS($M$3:M45))), \"\")","v":""},{"$f":"IFERROR(INDEX($G$2:$G$1840,_xlfn.AGGREGATE(15,3,(($A$2:$A$1840=$N$3)/($A$2:$A$1840=$N$3)*ROW($A$2:$A$1840))-ROW($A$1), ROWS($M$3:M45))), \"\")","v":""},""]
["0014","William Pittaway Elementary","00140005",null,"PK","NT",56,null,"EES",6,0,null,null,null,{"$f":"IFERROR((RANK(T46,$T$3:$T$191,0)+COUNTIF($T$3:T46, T46)-1), \"\")","v":""},{"$f":"IFERROR(INDEX($C$2:$C$1840,_xlfn.AGGREGATE(15,3,(($A$2:$A$1840=$N$3)/($A$2:$A$1840=$N$3)*ROW($A$2:$A$1840))-ROW($A$1), ROWS($M$3:M46))), \"\")","v":""},{"$f":"IFERROR(INDEX($B$2:$B$1840,_xlfn.AGGREGATE(15,3,(($A$2:$A$1840=$N$3)/($A$2:$A$1840=$N$3)*ROW($A$2:$A$1840))-ROW($A$1), ROWS($M$3:M46))), \"\")","v":""},{"$f":"IFERROR(INDEX($J$2:$J$1840,_xlfn.AGGREGATE(15,3,(($A$2:$A$1840=$N$3)/($A$2:$A$1840=$N$3)*ROW($A$2:$A$1840))-ROW($A$1), ROWS($M$3:M46))), \"\")","v":""},{"$f":"IFERROR(INDEX($G$2:$G$1840,_xlfn.AGGREGATE(15,3,(($A$2:$A$1840=$N$3)/($A$2:$A$1840=$N$3)*ROW($A$2:$A$1840))-ROW($A$1), ROWS($M$3:M46))), \"\")","v":""},""]
["0014","Henry E Warren Elementary","00140010",null,"K - 02","TA",578,null,"EES",115,184,null,null,null,{"$f":"IFERROR((RANK(T47,$T$3:$T$191,0)+COUNTIF($T$3:T47, T47)-1), \"\")","v":""},{"$f":"IFERROR(INDEX($C$2:$C$1840,_xlfn.AGGREGATE(15,3,(($A$2:$A$1840=$N$3)/($A$2:$A$1840=$N$3)*ROW($A$2:$A$1840))-ROW($A$1), ROWS($M$3:M47))), \"\")","v":""},{"$f":"IFERROR(INDEX($B$2:$B$1840,_xlfn.AGGREGATE(15,3,(($A$2:$A$1840=$N$3)/($A$2:$A$1840=$N$3)*ROW($A$2:$A$1840))-ROW($A$1), ROWS($M$3:M47))), \"\")","v":""},{"$f":"IFERROR(INDEX($J$2:$J$1840,_xlfn.AGGREGATE(15,3,(($A$2:$A$1840=$N$3)/($A$2:$A$1840=$N$3)*ROW($A$2:$A$1840))-ROW($A$1), ROWS($M$3:M47))), \"\")","v":""},{"$f":"IFERROR(INDEX($G$2:$G$1840,_xlfn.AGGREGATE(15,3,(($A$2:$A$1840=$N$3)/($A$2:$A$1840=$N$3)*ROW($A$2:$A$1840))-ROW($A$1), ROWS($M$3:M47))), \"\")","v":""},""]
["0014","David Mindess","00140015",null,"03 - 05","TA",634,null,"ES",107,171.20000000000002,null,null,null,{"$f":"IFERROR((RANK(T48,$T$3:$T$191,0)+COUNTIF($T$3:T48, T48)-1), \"\")","v":""},{"$f":"IFERROR(INDEX($C$2:$C$1840,_xlfn.AGGREGATE(15,3,(($A$2:$A$1840=$N$3)/($A$2:$A$1840=$N$3)*ROW($A$2:$A$1840))-ROW($A$1), ROWS($M$3:M48))), \"\")","v":""},{"$f":"IFERROR(INDEX($B$2:$B$1840,_xlfn.AGGREGATE(15,3,(($A$2:$A$1840=$N$3)/($A$2:$A$1840=$N$3)*ROW($A$2:$A$1840))-ROW($A$1), ROWS($M$3:M48))), \"\")","v":""},{"$f":"IFERROR(INDEX($J$2:$J$1840,_xlfn.AGGREGATE(15,3,(($A$2:$A$1840=$N$3)/($A$2:$A$1840=$N$3)*ROW($A$2:$A$1840))-ROW($A$1), ROWS($M$3:M48))), \"\")","v":""},{"$f":"IFERROR(INDEX($G$2:$G$1840,_xlfn.AGGREGATE(15,3,(($A$2:$A$1840=$N$3)/($A$2:$A$1840=$N$3)*ROW($A$2:$A$1840))-ROW($A$1), ROWS($M$3:M48))), \"\")","v":""},""]
["0014","Ashland Middle","00140405",null,"06 - 08","TA",671,null,"MS",137,219.20000000000002,null,null,null,{"$f":"IFERROR((RANK(T49,$T$3:$T$191,0)+COUNTIF($T$3:T49, T49)-1), \"\")","v":""},{"$f":"IFERROR(INDEX($C$2:$C$1840,_xlfn.AGGREGATE(15,3,(($A$2:$A$1840=$N$3)/($A$2:$A$1840=$N$3)*ROW($A$2:$A$1840))-ROW($A$1), ROWS($M$3:M49))), \"\")","v":""},{"$f":"IFERROR(INDEX($B$2:$B$1840,_xlfn.AGGREGATE(15,3,(($A$2:$A$1840=$N$3)/($A$2:$A$1840=$N$3)*ROW($A$2:$A$1840))-ROW($A$1), ROWS($M$3:M49))), \"\")","v":""},{"$f":"IFERROR(INDEX($J$2:$J$1840,_xlfn.AGGREGATE(15,3,(($A$2:$A$1840=$N$3)/($A$2:$A$1840=$N$3)*ROW($A$2:$A$1840))-ROW($A$1), ROWS($M$3:M49))), \"\")","v":""},{"$f":"IFERROR(INDEX($G$2:$G$1840,_xlfn.AGGREGATE(15,3,(($A$2:$A$1840=$N$3)/($A$2:$A$1840=$N$3)*ROW($A$2:$A$1840))-ROW($A$1), ROWS($M$3:M49))), \"\")","v":""},""]
["0014","Ashland High","00140505",null,"09 - 12","NT",806,null,"HS",132,211.20000000000002,null,null,null,{"$f":"IFERROR((RANK(T50,$T$3:$T$191,0)+COUNTIF($T$3:T50, T50)-1), \"\")","v":""},{"$f":"IFERROR(INDEX($C$2:$C$1840,_xlfn.AGGREGATE(15,3,(($A$2:$A$1840=$N$3)/($A$2:$A$1840=$N$3)*ROW($A$2:$A$1840))-ROW($A$1), ROWS($M$3:M50))), \"\")","v":""},{"$f":"IFERROR(INDEX($B$2:$B$1840,_xlfn.AGGREGATE(15,3,(($A$2:$A$1840=$N$3)/($A$2:$A$1840=$N$3)*ROW($A$2:$A$1840))-ROW($A$1), ROWS($M$3:M50))), \"\")","v":""},{"$f":"IFERROR(INDEX($J$2:$J$1840,_xlfn.AGGREGATE(15,3,(($A$2:$A$1840=$N$3)/($A$2:$A$1840=$N$3)*ROW($A$2:$A$1840))-ROW($A$1), ROWS($M$3:M50))), \"\")","v":""},{"$f":"IFERROR(INDEX($G$2:$G$1840,_xlfn.AGGREGATE(15,3,(($A$2:$A$1840=$N$3)/($A$2:$A$1840=$N$3)*ROW($A$2:$A$1840))-ROW($A$1), ROWS($M$3:M50))), \"\")","v":""},""]
["0016","A. Irvin Studley Elementary School","00160001",null,"K - 04","SW",325,null,"ES",98,156.80000000000001,null,null,null,{"$f":"IFERROR((RANK(T51,$T$3:$T$191,0)+COUNTIF($T$3:T51, T51)-1), \"\")","v":""},{"$f":"IFERROR(INDEX($C$2:$C$1840,_xlfn.AGGREGATE(15,3,(($A$2:$A$1840=$N$3)/($A$2:$A$1840=$N$3)*ROW($A$2:$A$1840))-ROW($A$1), ROWS($M$3:M51))), \"\")","v":""},{"$f":"IFERROR(INDEX($B$2:$B$1840,_xlfn.AGGREGATE(15,3,(($A$2:$A$1840=$N$3)/($A$2:$A$1840=$N$3)*ROW($A$2:$A$1840))-ROW($A$1), ROWS($M$3:M51))), \"\")","v":""},{"$f":"IFERROR(INDEX($J$2:$J$1840,_xlfn.AGGREGATE(15,3,(($A$2:$A$1840=$N$3)/($A$2:$A$1840=$N$3)*ROW($A$2:$A$1840))-ROW($A$1), ROWS($M$3:M51))), \"\")","v":""},{"$f":"IFERROR(INDEX($G$2:$G$1840,_xlfn.AGGREGATE(15,3,(($A$2:$A$1840=$N$3)/($A$2:$A$1840=$N$3)*ROW($A$2:$A$1840))-ROW($A$1), ROWS($M$3:M51))), \"\")","v":""},""]
["0016","Early Learning Center","00160008",null,"PK","NT",121,null,"EES",48,0,null,null,null,{"$f":"IFERROR((RANK(T52,$T$3:$T$191,0)+COUNTIF($T$3:T52, T52)-1), \"\")","v":""},{"$f":"IFERROR(INDEX($C$2:$C$1840,_xlfn.AGGREGATE(15,3,(($A$2:$A$1840=$N$3)/($A$2:$A$1840=$N$3)*ROW($A$2:$A$1840))-ROW($A$1), ROWS($M$3:M52))), \"\")","v":""},{"$f":"IFERROR(INDEX($B$2:$B$1840,_xlfn.AGGREGATE(15,3,(($A$2:$A$1840=$N$3)/($A$2:$A$1840=$N$3)*ROW($A$2:$A$1840))-ROW($A$1), ROWS($M$3:M52))), \"\")","v":""},{"$f":"IFERROR(INDEX($J$2:$J$1840,_xlfn.AGGREGATE(15,3,(($A$2:$A$1840=$N$3)/($A$2:$A$1840=$N$3)*ROW($A$2:$A$1840))-ROW($A$1), ROWS($M$3:M52))), \"\")","v":""},{"$f":"IFERROR(INDEX($G$2:$G$1840,_xlfn.AGGREGATE(15,3,(($A$2:$A$1840=$N$3)/($A$2:$A$1840=$N$3)*ROW($A$2:$A$1840))-ROW($A$1), ROWS($M$3:M52))), \"\")","v":""},""]
["0016","Thomas Willett Elementary School","00160035",null,"K - 04","SW",330,null,"ES",127,203.20000000000002,null,null,null,{"$f":"IFERROR((RANK(T53,$T$3:$T$191,0)+COUNTIF($T$3:T53, T53)-1), \"\")","v":""},{"$f":"IFERROR(INDEX($C$2:$C$1840,_xlfn.AGGREGATE(15,3,(($A$2:$A$1840=$N$3)/($A$2:$A$1840=$N$3)*ROW($A$2:$A$1840))-ROW($A$1), ROWS($M$3:M53))), \"\")","v":""},{"$f":"IFERROR(INDEX($B$2:$B$1840,_xlfn.AGGREGATE(15,3,(($A$2:$A$1840=$N$3)/($A$2:$A$1840=$N$3)*ROW($A$2:$A$1840))-ROW($A$1), ROWS($M$3:M53))), \"\")","v":""},{"$f":"IFERROR(INDEX($J$2:$J$1840,_xlfn.AGGREGATE(15,3,(($A$2:$A$1840=$N$3)/($A$2:$A$1840=$N$3)*ROW($A$2:$A$1840))-ROW($A$1), ROWS($M$3:M53))), \"\")","v":""},{"$f":"IFERROR(INDEX($G$2:$G$1840,_xlfn.AGGREGATE(15,3,(($A$2:$A$1840=$N$3)/($A$2:$A$1840=$N$3)*ROW($A$2:$A$1840))-ROW($A$1), ROWS($M$3:M53))), \"\")","v":""},""]
["0016","Hyman Fine Elementary School","00160040",null,"K - 04","SW",448,null,"ES",164,262.40000000000003,null,null,null,{"$f":"IFERROR((RANK(T54,$T$3:$T$191,0)+COUNTIF($T$3:T54, T54)-1), \"\")","v":""},{"$f":"IFERROR(INDEX($C$2:$C$1840,_xlfn.AGGREGATE(15,3,(($A$2:$A$1840=$N$3)/($A$2:$A$1840=$N$3)*ROW($A$2:$A$1840))-ROW($A$1), ROWS($M$3:M54))), \"\")","v":""},{"$f":"IFERROR(INDEX($B$2:$B$1840,_xlfn.AGGREGATE(15,3,(($A$2:$A$1840=$N$3)/($A$2:$A$1840=$N$3)*ROW($A$2:$A$1840))-ROW($A$1), ROWS($M$3:M54))), \"\")","v":""},{"$f":"IFERROR(INDEX($J$2:$J$1840,_xlfn.AGGREGATE(15,3,(($A$2:$A$1840=$N$3)/($A$2:$A$1840=$N$3)*ROW($A$2:$A$1840))-ROW($A$1), ROWS($M$3:M54))), \"\")","v":""},{"$f":"IFERROR(INDEX($G$2:$G$1840,_xlfn.AGGREGATE(15,3,(($A$2:$A$1840=$N$3)/($A$2:$A$1840=$N$3)*ROW($A$2:$A$1840))-ROW($A$1), ROWS($M$3:M54))), \"\")","v":""},""]
["0016","Hill-Roberts Elementary School","00160045",null,"K - 04","SW",413,null,"ES",146,233.60000000000002,null,null,null,{"$f":"IFERROR((RANK(T55,$T$3:$T$191,0)+COUNTIF($T$3:T55, T55)-1), \"\")","v":""},{"$f":"IFERROR(INDEX($C$2:$C$1840,_xlfn.AGGREGATE(15,3,(($A$2:$A$1840=$N$3)/($A$2:$A$1840=$N$3)*ROW($A$2:$A$1840))-ROW($A$1), ROWS($M$3:M55))), \"\")","v":""},{"$f":"IFERROR(INDEX($B$2:$B$1840,_xlfn.AGGREGATE(15,3,(($A$2:$A$1840=$N$3)/($A$2:$A$1840=$N$3)*ROW($A$2:$A$1840))-ROW($A$1), ROWS($M$3:M55))), \"\")","v":""},{"$f":"IFERROR(INDEX($J$2:$J$1840,_xlfn.AGGREGATE(15,3,(($A$2:$A$1840=$N$3)/($A$2:$A$1840=$N$3)*ROW($A$2:$A$1840))-ROW($A$1), ROWS($M$3:M55))), \"\")","v":""},{"$f":"IFERROR(INDEX($G$2:$G$1840,_xlfn.AGGREGATE(15,3,(($A$2:$A$1840=$N$3)/($A$2:$A$1840=$N$3)*ROW($A$2:$A$1840))-ROW($A$1), ROWS($M$3:M55))), \"\")","v":""},""]
["0016","Peter Thacher Elementary School","00160050",null,"K - 04","SW",445,null,"ES",191,305.60000000000002,null,null,null,{"$f":"IFERROR((RANK(T56,$T$3:$T$191,0)+COUNTIF($T$3:T56, T56)-1), \"\")","v":""},{"$f":"IFERROR(INDEX($C$2:$C$1840,_xlfn.AGGREGATE(15,3,(($A$2:$A$1840=$N$3)/($A$2:$A$1840=$N$3)*ROW($A$2:$A$1840))-ROW($A$1), ROWS($M$3:M56))), \"\")","v":""},{"$f":"IFERROR(INDEX($B$2:$B$1840,_xlfn.AGGREGATE(15,3,(($A$2:$A$1840=$N$3)/($A$2:$A$1840=$N$3)*ROW($A$2:$A$1840))-ROW($A$1), ROWS($M$3:M56))), \"\")","v":""},{"$f":"IFERROR(INDEX($J$2:$J$1840,_xlfn.AGGREGATE(15,3,(($A$2:$A$1840=$N$3)/($A$2:$A$1840=$N$3)*ROW($A$2:$A$1840))-ROW($A$1), ROWS($M$3:M56))), \"\")","v":""},{"$f":"IFERROR(INDEX($G$2:$G$1840,_xlfn.AGGREGATE(15,3,(($A$2:$A$1840=$N$3)/($A$2:$A$1840=$N$3)*ROW($A$2:$A$1840))-ROW($A$1), ROWS($M$3:M56))), \"\")","v":""},""]
["0016","Robert J. Coelho Middle School","00160305",null,"05 - 08","NT",630,null,"MS",200,320,null,null,null,{"$f":"IFERROR((RANK(T57,$T$3:$T$191,0)+COUNTIF($T$3:T57, T57)-1), \"\")","v":""},{"$f":"IFERROR(INDEX($C$2:$C$1840,_xlfn.AGGREGATE(15,3,(($A$2:$A$1840=$N$3)/($A$2:$A$1840=$N$3)*ROW($A$2:$A$1840))-ROW($A$1), ROWS($M$3:M57))), \"\")","v":""},{"$f":"IFERROR(INDEX($B$2:$B$1840,_xlfn.AGGREGATE(15,3,(($A$2:$A$1840=$N$3)/($A$2:$A$1840=$N$3)*ROW($A$2:$A$1840))-ROW($A$1), ROWS($M$3:M57))), \"\")","v":""},{"$f":"IFERROR(INDEX($J$2:$J$1840,_xlfn.AGGREGATE(15,3,(($A$2:$A$1840=$N$3)/($A$2:$A$1840=$N$3)*ROW($A$2:$A$1840))-ROW($A$1), ROWS($M$3:M57))), \"\")","v":""},{"$f":"IFERROR(INDEX($G$2:$G$1840,_xlfn.AGGREGATE(15,3,(($A$2:$A$1840=$N$3)/($A$2:$A$1840=$N$3)*ROW($A$2:$A$1840))-ROW($A$1), ROWS($M$3:M57))), \"\")","v":""},""]
["0016","Cyril K. Brennan Middle School","00160315",null,"05 - 08","NT",626,null,"MS",268,428.8,null,null,null,{"$f":"IFERROR((RANK(T58,$T$3:$T$191,0)+COUNTIF($T$3:T58, T58)-1), \"\")","v":""},{"$f":"IFERROR(INDEX($C$2:$C$1840,_xlfn.AGGREGATE(15,3,(($A$2:$A$1840=$N$3)/($A$2:$A$1840=$N$3)*ROW($A$2:$A$1840))-ROW($A$1), ROWS($M$3:M58))), \"\")","v":""},{"$f":"IFERROR(INDEX($B$2:$B$1840,_xlfn.AGGREGATE(15,3,(($A$2:$A$1840=$N$3)/($A$2:$A$1840=$N$3)*ROW($A$2:$A$1840))-ROW($A$1), ROWS($M$3:M58))), \"\")","v":""},{"$f":"IFERROR(INDEX($J$2:$J$1840,_xlfn.AGGREGATE(15,3,(($A$2:$A$1840=$N$3)/($A$2:$A$1840=$N$3)*ROW($A$2:$A$1840))-ROW($A$1), ROWS($M$3:M58))), \"\")","v":""},{"$f":"IFERROR(INDEX($G$2:$G$1840,_xlfn.AGGREGATE(15,3,(($A$2:$A$1840=$N$3)/($A$2:$A$1840=$N$3)*ROW($A$2:$A$1840))-ROW($A$1), ROWS($M$3:M58))), \"\")","v":""},""]
["0016","Wamsutta Middle School","00160320",null,"05 - 08","NT",565,null,"MS",172,275.2,null,null,null,{"$f":"IFERROR((RANK(T59,$T$3:$T$191,0)+COUNTIF($T$3:T59, T59)-1), \"\")","v":""},{"$f":"IFERROR(INDEX($C$2:$C$1840,_xlfn.AGGREGATE(15,3,(($A$2:$A$1840=$N$3)/($A$2:$A$1840=$N$3)*ROW($A$2:$A$1840))-ROW($A$1), ROWS($M$3:M59))), \"\")","v":""},{"$f":"IFERROR(INDEX($B$2:$B$1840,_xlfn.AGGREGATE(15,3,(($A$2:$A$1840=$N$3)/($A$2:$A$1840=$N$3)*ROW($A$2:$A$1840))-ROW($A$1), ROWS($M$3:M59))), \"\")","v":""},{"$f":"IFERROR(INDEX($J$2:$J$1840,_xlfn.AGGREGATE(15,3,(($A$2:$A$1840=$N$3)/($A$2:$A$1840=$N$3)*ROW($A$2:$A$1840))-ROW($A$1), ROWS($M$3:M59))), \"\")","v":""},{"$f":"IFERROR(INDEX($G$2:$G$1840,_xlfn.AGGREGATE(15,3,(($A$2:$A$1840=$N$3)/($A$2:$A$1840=$N$3)*ROW($A$2:$A$1840))-ROW($A$1), ROWS($M$3:M59))), \"\")","v":""},""]
["0016","Attleboro High","00160505",null,"09 - 12","NT",1745,null,"HS",517,811.2,null,null,null,{"$f":"IFERROR((RANK(T60,$T$3:$T$191,0)+COUNTIF($T$3:T60, T60)-1), \"\")","v":""},{"$f":"IFERROR(INDEX($C$2:$C$1840,_xlfn.AGGREGATE(15,3,(($A$2:$A$1840=$N$3)/($A$2:$A$1840=$N$3)*ROW($A$2:$A$1840))-ROW($A$1), ROWS($M$3:M60))), \"\")","v":""},{"$f":"IFERROR(INDEX($B$2:$B$1840,_xlfn.AGGREGATE(15,3,(($A$2:$A$1840=$N$3)/($A$2:$A$1840=$N$3)*ROW($A$2:$A$1840))-ROW($A$1), ROWS($M$3:M60))), \"\")","v":""},{"$f":"IFERROR(INDEX($J$2:$J$1840,_xlfn.AGGREGATE(15,3,(($A$2:$A$1840=$N$3)/($A$2:$A$1840=$N$3)*ROW($A$2:$A$1840))-ROW($A$1), ROWS($M$3:M60))), \"\")","v":""},{"$f":"IFERROR(INDEX($G$2:$G$1840,_xlfn.AGGREGATE(15,3,(($A$2:$A$1840=$N$3)/($A$2:$A$1840=$N$3)*ROW($A$2:$A$1840))-ROW($A$1), ROWS($M$3:M60))), \"\")","v":""},""]
["0016","Attleboro Community Academy","00160515",null,"09 - 12","NT",54,null,"HS",26,41.6,null,null,null,{"$f":"IFERROR((RANK(T61,$T$3:$T$191,0)+COUNTIF($T$3:T61, T61)-1), \"\")","v":""},{"$f":"IFERROR(INDEX($C$2:$C$1840,_xlfn.AGGREGATE(15,3,(($A$2:$A$1840=$N$3)/($A$2:$A$1840=$N$3)*ROW($A$2:$A$1840))-ROW($A$1), ROWS($M$3:M61))), \"\")","v":""},{"$f":"IFERROR(INDEX($B$2:$B$1840,_xlfn.AGGREGATE(15,3,(($A$2:$A$1840=$N$3)/($A$2:$A$1840=$N$3)*ROW($A$2:$A$1840))-ROW($A$1), ROWS($M$3:M61))), \"\")","v":""},{"$f":"IFERROR(INDEX($J$2:$J$1840,_xlfn.AGGREGATE(15,3,(($A$2:$A$1840=$N$3)/($A$2:$A$1840=$N$3)*ROW($A$2:$A$1840))-ROW($A$1), ROWS($M$3:M61))), \"\")","v":""},{"$f":"IFERROR(INDEX($G$2:$G$1840,_xlfn.AGGREGATE(15,3,(($A$2:$A$1840=$N$3)/($A$2:$A$1840=$N$3)*ROW($A$2:$A$1840))-ROW($A$1), ROWS($M$3:M61))), \"\")","v":""},""]
["0017","Bryn Mawr","00170010",null,"K - 02","TA",262,null,"EES",73,116.80000000000001,null,null,null,{"$f":"IFERROR((RANK(T62,$T$3:$T$191,0)+COUNTIF($T$3:T62, T62)-1), \"\")","v":""},{"$f":"IFERROR(INDEX($C$2:$C$1840,_xlfn.AGGREGATE(15,3,(($A$2:$A$1840=$N$3)/($A$2:$A$1840=$N$3)*ROW($A$2:$A$1840))-ROW($A$1), ROWS($M$3:M62))), \"\")","v":""},{"$f":"IFERROR(INDEX($B$2:$B$1840,_xlfn.AGGREGATE(15,3,(($A$2:$A$1840=$N$3)/($A$2:$A$1840=$N$3)*ROW($A$2:$A$1840))-ROW($A$1), ROWS($M$3:M62))), \"\")","v":""},{"$f":"IFERROR(INDEX($J$2:$J$1840,_xlfn.AGGREGATE(15,3,(($A$2:$A$1840=$N$3)/($A$2:$A$1840=$N$3)*ROW($A$2:$A$1840))-ROW($A$1), ROWS($M$3:M62))), \"\")","v":""},{"$f":"IFERROR(INDEX($G$2:$G$1840,_xlfn.AGGREGATE(15,3,(($A$2:$A$1840=$N$3)/($A$2:$A$1840=$N$3)*ROW($A$2:$A$1840))-ROW($A$1), ROWS($M$3:M62))), \"\")","v":""},""]
["0017","Pakachoag School","00170025",null,"K - 02","NT",270,null,"EES",58,92.800000000000011,null,null,null,{"$f":"IFERROR((RANK(T63,$T$3:$T$191,0)+COUNTIF($T$3:T63, T63)-1), \"\")","v":""},{"$f":"IFERROR(INDEX($C$2:$C$1840,_xlfn.AGGREGATE(15,3,(($A$2:$A$1840=$N$3)/($A$2:$A$1840=$N$3)*ROW($A$2:$A$1840))-ROW($A$1), ROWS($M$3:M63))), \"\")","v":""},{"$f":"IFERROR(INDEX($B$2:$B$1840,_xlfn.AGGREGATE(15,3,(($A$2:$A$1840=$N$3)/($A$2:$A$1840=$N$3)*ROW($A$2:$A$1840))-ROW($A$1), ROWS($M$3:M63))), \"\")","v":""},{"$f":"IFERROR(INDEX($J$2:$J$1840,_xlfn.AGGREGATE(15,3,(($A$2:$A$1840=$N$3)/($A$2:$A$1840=$N$3)*ROW($A$2:$A$1840))-ROW($A$1), ROWS($M$3:M63))), \"\")","v":""},{"$f":"IFERROR(INDEX($G$2:$G$1840,_xlfn.AGGREGATE(15,3,(($A$2:$A$1840=$N$3)/($A$2:$A$1840=$N$3)*ROW($A$2:$A$1840))-ROW($A$1), ROWS($M$3:M63))), \"\")","v":""},""]
["0017","Swanson Road Intermediate School","00170030",null,"03 - 05","TA",560,null,"ES",122,195.20000000000002,null,null,null,{"$f":"IFERROR((RANK(T64,$T$3:$T$191,0)+COUNTIF($T$3:T64, T64)-1), \"\")","v":""},{"$f":"IFERROR(INDEX($C$2:$C$1840,_xlfn.AGGREGATE(15,3,(($A$2:$A$1840=$N$3)/($A$2:$A$1840=$N$3)*ROW($A$2:$A$1840))-ROW($A$1), ROWS($M$3:M64))), \"\")","v":""},{"$f":"IFERROR(INDEX($B$2:$B$1840,_xlfn.AGGREGATE(15,3,(($A$2:$A$1840=$N$3)/($A$2:$A$1840=$N$3)*ROW($A$2:$A$1840))-ROW($A$1), ROWS($M$3:M64))), \"\")","v":""},{"$f":"IFERROR(INDEX($J$2:$J$1840,_xlfn.AGGREGATE(15,3,(($A$2:$A$1840=$N$3)/($A$2:$A$1840=$N$3)*ROW($A$2:$A$1840))-ROW($A$1), ROWS($M$3:M64))), \"\")","v":""},{"$f":"IFERROR(INDEX($G$2:$G$1840,_xlfn.AGGREGATE(15,3,(($A$2:$A$1840=$N$3)/($A$2:$A$1840=$N$3)*ROW($A$2:$A$1840))-ROW($A$1), ROWS($M$3:M64))), \"\")","v":""},""]
["0017","Auburn Middle","00170305",null,"06 - 08","TA",630,null,"MS",133,212.8,null,null,null,{"$f":"IFERROR((RANK(T65,$T$3:$T$191,0)+COUNTIF($T$3:T65, T65)-1), \"\")","v":""},{"$f":"IFERROR(INDEX($C$2:$C$1840,_xlfn.AGGREGATE(15,3,(($A$2:$A$1840=$N$3)/($A$2:$A$1840=$N$3)*ROW($A$2:$A$1840))-ROW($A$1), ROWS($M$3:M65))), \"\")","v":""},{"$f":"IFERROR(INDEX($B$2:$B$1840,_xlfn.AGGREGATE(15,3,(($A$2:$A$1840=$N$3)/($A$2:$A$1840=$N$3)*ROW($A$2:$A$1840))-ROW($A$1), ROWS($M$3:M65))), \"\")","v":""},{"$f":"IFERROR(INDEX($J$2:$J$1840,_xlfn.AGGREGATE(15,3,(($A$2:$A$1840=$N$3)/($A$2:$A$1840=$N$3)*ROW($A$2:$A$1840))-ROW($A$1), ROWS($M$3:M65))), \"\")","v":""},{"$f":"IFERROR(INDEX($G$2:$G$1840,_xlfn.AGGREGATE(15,3,(($A$2:$A$1840=$N$3)/($A$2:$A$1840=$N$3)*ROW($A$2:$A$1840))-ROW($A$1), ROWS($M$3:M65))), \"\")","v":""},""]
["0017","Auburn Senior High","00170505",null,"PK,09 - 12","NT",791,null,"HS",180,240,null,null,null,{"$f":"IFERROR((RANK(T66,$T$3:$T$191,0)+COUNTIF($T$3:T66, T66)-1), \"\")","v":""},{"$f":"IFERROR(INDEX($C$2:$C$1840,_xlfn.AGGREGATE(15,3,(($A$2:$A$1840=$N$3)/($A$2:$A$1840=$N$3)*ROW($A$2:$A$1840))-ROW($A$1), ROWS($M$3:M66))), \"\")","v":""},{"$f":"IFERROR(INDEX($B$2:$B$1840,_xlfn.AGGREGATE(15,3,(($A$2:$A$1840=$N$3)/($A$2:$A$1840=$N$3)*ROW($A$2:$A$1840))-ROW($A$1), ROWS($M$3:M66))), \"\")","v":""},{"$f":"IFERROR(INDEX($J$2:$J$1840,_xlfn.AGGREGATE(15,3,(($A$2:$A$1840=$N$3)/($A$2:$A$1840=$N$3)*ROW($A$2:$A$1840))-ROW($A$1), ROWS($M$3:M66))), \"\")","v":""},{"$f":"IFERROR(INDEX($G$2:$G$1840,_xlfn.AGGREGATE(15,3,(($A$2:$A$1840=$N$3)/($A$2:$A$1840=$N$3)*ROW($A$2:$A$1840))-ROW($A$1), ROWS($M$3:M66))), \"\")","v":""},""]
["0018","Ralph D Butler","00180010",null,"PK - 06","TA",373,null,"ES",133,211.20000000000002,null,null,null,{"$f":"IFERROR((RANK(T67,$T$3:$T$191,0)+COUNTIF($T$3:T67, T67)-1), \"\")","v":""},{"$f":"IFERROR(INDEX($C$2:$C$1840,_xlfn.AGGREGATE(15,3,(($A$2:$A$1840=$N$3)/($A$2:$A$1840=$N$3)*ROW($A$2:$A$1840))-ROW($A$1), ROWS($M$3:M67))), \"\")","v":""},{"$f":"IFERROR(INDEX($B$2:$B$1840,_xlfn.AGGREGATE(15,3,(($A$2:$A$1840=$N$3)/($A$2:$A$1840=$N$3)*ROW($A$2:$A$1840))-ROW($A$1), ROWS($M$3:M67))), \"\")","v":""},{"$f":"IFERROR(INDEX($J$2:$J$1840,_xlfn.AGGREGATE(15,3,(($A$2:$A$1840=$N$3)/($A$2:$A$1840=$N$3)*ROW($A$2:$A$1840))-ROW($A$1), ROWS($M$3:M67))), \"\")","v":""},{"$f":"IFERROR(INDEX($G$2:$G$1840,_xlfn.AGGREGATE(15,3,(($A$2:$A$1840=$N$3)/($A$2:$A$1840=$N$3)*ROW($A$2:$A$1840))-ROW($A$1), ROWS($M$3:M67))), \"\")","v":""},{"$f":"IFERROR(R67/S67, \"\")","v":""}]
["0018","Avon Middle High School","00180510",null,"07 - 12","NT",313,null,"MSHS/K-12",115,184,null,null,null,{"$f":"IFERROR((RANK(T68,$T$3:$T$191,0)+COUNTIF($T$3:T68, T68)-1), \"\")","v":""},{"$f":"IFERROR(INDEX($C$2:$C$1840,_xlfn.AGGREGATE(15,3,(($A$2:$A$1840=$N$3)/($A$2:$A$1840=$N$3)*ROW($A$2:$A$1840))-ROW($A$1), ROWS($M$3:M68))), \"\")","v":""},{"$f":"IFERROR(INDEX($B$2:$B$1840,_xlfn.AGGREGATE(15,3,(($A$2:$A$1840=$N$3)/($A$2:$A$1840=$N$3)*ROW($A$2:$A$1840))-ROW($A$1), ROWS($M$3:M68))), \"\")","v":""},{"$f":"IFERROR(INDEX($J$2:$J$1840,_xlfn.AGGREGATE(15,3,(($A$2:$A$1840=$N$3)/($A$2:$A$1840=$N$3)*ROW($A$2:$A$1840))-ROW($A$1), ROWS($M$3:M68))), \"\")","v":""},{"$f":"IFERROR(INDEX($G$2:$G$1840,_xlfn.AGGREGATE(15,3,(($A$2:$A$1840=$N$3)/($A$2:$A$1840=$N$3)*ROW($A$2:$A$1840))-ROW($A$1), ROWS($M$3:M68))), \"\")","v":""},""]
["0020","Enoch Cobb Early Learning Center","00200001",null,"PK","NT",136,null,"EES",64,0,null,null,null,{"$f":"IFERROR((RANK(T69,$T$3:$T$191,0)+COUNTIF($T$3:T69, T69)-1), \"\")","v":""},{"$f":"IFERROR(INDEX($C$2:$C$1840,_xlfn.AGGREGATE(15,3,(($A$2:$A$1840=$N$3)/($A$2:$A$1840=$N$3)*ROW($A$2:$A$1840))-ROW($A$1), ROWS($M$3:M69))), \"\")","v":""},{"$f":"IFERROR(INDEX($B$2:$B$1840,_xlfn.AGGREGATE(15,3,(($A$2:$A$1840=$N$3)/($A$2:$A$1840=$N$3)*ROW($A$2:$A$1840))-ROW($A$1), ROWS($M$3:M69))), \"\")","v":""},{"$f":"IFERROR(INDEX($J$2:$J$1840,_xlfn.AGGREGATE(15,3,(($A$2:$A$1840=$N$3)/($A$2:$A$1840=$N$3)*ROW($A$2:$A$1840))-ROW($A$1), ROWS($M$3:M69))), \"\")","v":""},{"$f":"IFERROR(INDEX($G$2:$G$1840,_xlfn.AGGREGATE(15,3,(($A$2:$A$1840=$N$3)/($A$2:$A$1840=$N$3)*ROW($A$2:$A$1840))-ROW($A$1), ROWS($M$3:M69))), \"\")","v":""},""]
["0020","West Barnstable Elementary","00200005",null,"K - 03","NT",228,null,"ES",97,155.20000000000002,null,null,null,{"$f":"IFERROR((RANK(T70,$T$3:$T$191,0)+COUNTIF($T$3:T70, T70)-1), \"\")","v":""},{"$f":"IFERROR(INDEX($C$2:$C$1840,_xlfn.AGGREGATE(15,3,(($A$2:$A$1840=$N$3)/($A$2:$A$1840=$N$3)*ROW($A$2:$A$1840))-ROW($A$1), ROWS($M$3:M70))), \"\")","v":""},{"$f":"IFERROR(INDEX($B$2:$B$1840,_xlfn.AGGREGATE(15,3,(($A$2:$A$1840=$N$3)/($A$2:$A$1840=$N$3)*ROW($A$2:$A$1840))-ROW($A$1), ROWS($M$3:M70))), \"\")","v":""},{"$f":"IFERROR(INDEX($J$2:$J$1840,_xlfn.AGGREGATE(15,3,(($A$2:$A$1840=$N$3)/($A$2:$A$1840=$N$3)*ROW($A$2:$A$1840))-ROW($A$1), ROWS($M$3:M70))), \"\")","v":""},{"$f":"IFERROR(INDEX($G$2:$G$1840,_xlfn.AGGREGATE(15,3,(($A$2:$A$1840=$N$3)/($A$2:$A$1840=$N$3)*ROW($A$2:$A$1840))-ROW($A$1), ROWS($M$3:M70))), \"\")","v":""},""]
["0020","Centerville Elementary","00200010",null,"K - 03","NT",234,null,"ES",108,172.8,null,null,null,{"$f":"IFERROR((RANK(T71,$T$3:$T$191,0)+COUNTIF($T$3:T71, T71)-1), \"\")","v":""},{"$f":"IFERROR(INDEX($C$2:$C$1840,_xlfn.AGGREGATE(15,3,(($A$2:$A$1840=$N$3)/($A$2:$A$1840=$N$3)*ROW($A$2:$A$1840))-ROW($A$1), ROWS($M$3:M71))), \"\")","v":""},{"$f":"IFERROR(INDEX($B$2:$B$1840,_xlfn.AGGREGATE(15,3,(($A$2:$A$1840=$N$3)/($A$2:$A$1840=$N$3)*ROW($A$2:$A$1840))-ROW($A$1), ROWS($M$3:M71))), \"\")","v":""},{"$f":"IFERROR(INDEX($J$2:$J$1840,_xlfn.AGGREGATE(15,3,(($A$2:$A$1840=$N$3)/($A$2:$A$1840=$N$3)*ROW($A$2:$A$1840))-ROW($A$1), ROWS($M$3:M71))), \"\")","v":""},{"$f":"IFERROR(INDEX($G$2:$G$1840,_xlfn.AGGREGATE(15,3,(($A$2:$A$1840=$N$3)/($A$2:$A$1840=$N$3)*ROW($A$2:$A$1840))-ROW($A$1), ROWS($M$3:M71))), \"\")","v":""},""]
["0020","Barnstable Community Innovation School","00200012",null,"K - 03","SW",285,null,"ES",142,227.20000000000002,null,null,null,{"$f":"IFERROR((RANK(T72,$T$3:$T$191,0)+COUNTIF($T$3:T72, T72)-1), \"\")","v":""},{"$f":"IFERROR(INDEX($C$2:$C$1840,_xlfn.AGGREGATE(15,3,(($A$2:$A$1840=$N$3)/($A$2:$A$1840=$N$3)*ROW($A$2:$A$1840))-ROW($A$1), ROWS($M$3:M72))), \"\")","v":""},{"$f":"IFERROR(INDEX($B$2:$B$1840,_xlfn.AGGREGATE(15,3,(($A$2:$A$1840=$N$3)/($A$2:$A$1840=$N$3)*ROW($A$2:$A$1840))-ROW($A$1), ROWS($M$3:M72))), \"\")","v":""},{"$f":"IFERROR(INDEX($J$2:$J$1840,_xlfn.AGGREGATE(15,3,(($A$2:$A$1840=$N$3)/($A$2:$A$1840=$N$3)*ROW($A$2:$A$1840))-ROW($A$1), ROWS($M$3:M72))), \"\")","v":""},{"$f":"IFERROR(INDEX($G$2:$G$1840,_xlfn.AGGREGATE(15,3,(($A$2:$A$1840=$N$3)/($A$2:$A$1840=$N$3)*ROW($A$2:$A$1840))-ROW($A$1), ROWS($M$3:M72))), \"\")","v":""},""]
["0020","Hyannis West Elementary","00200025",null,"K - 03","SW",288,null,"ES",196,313.60000000000002,null,null,null,{"$f":"IFERROR((RANK(T73,$T$3:$T$191,0)+COUNTIF($T$3:T73, T73)-1), \"\")","v":""},{"$f":"IFERROR(INDEX($C$2:$C$1840,_xlfn.AGGREGATE(15,3,(($A$2:$A$1840=$N$3)/($A$2:$A$1840=$N$3)*ROW($A$2:$A$1840))-ROW($A$1), ROWS($M$3:M73))), \"\")","v":""},{"$f":"IFERROR(INDEX($B$2:$B$1840,_xlfn.AGGREGATE(15,3,(($A$2:$A$1840=$N$3)/($A$2:$A$1840=$N$3)*ROW($A$2:$A$1840))-ROW($A$1), ROWS($M$3:M73))), \"\")","v":""},{"$f":"IFERROR(INDEX($J$2:$J$1840,_xlfn.AGGREGATE(15,3,(($A$2:$A$1840=$N$3)/($A$2:$A$1840=$N$3)*ROW($A$2:$A$1840))-ROW($A$1), ROWS($M$3:M73))), \"\")","v":""},{"$f":"IFERROR(INDEX($G$2:$G$1840,_xlfn.AGGREGATE(15,3,(($A$2:$A$1840=$N$3)/($A$2:$A$1840=$N$3)*ROW($A$2:$A$1840))-ROW($A$1), ROWS($M$3:M73))), \"\")","v":""},""]
["0020","West Villages Elementary School","00200045",null,"K - 03","NT",369,null,"ES",109,174.4,null,null,null,{"$f":"IFERROR((RANK(T74,$T$3:$T$191,0)+COUNTIF($T$3:T74, T74)-1), \"\")","v":""},{"$f":"IFERROR(INDEX($C$2:$C$1840,_xlfn.AGGREGATE(15,3,(($A$2:$A$1840=$N$3)/($A$2:$A$1840=$N$3)*ROW($A$2:$A$1840))-ROW($A$1), ROWS($M$3:M74))), \"\")","v":""},{"$f":"IFERROR(INDEX($B$2:$B$1840,_xlfn.AGGREGATE(15,3,(($A$2:$A$1840=$N$3)/($A$2:$A$1840=$N$3)*ROW($A$2:$A$1840))-ROW($A$1), ROWS($M$3:M74))), \"\")","v":""},{"$f":"IFERROR(INDEX($J$2:$J$1840,_xlfn.AGGREGATE(15,3,(($A$2:$A$1840=$N$3)/($A$2:$A$1840=$N$3)*ROW($A$2:$A$1840))-ROW($A$1), ROWS($M$3:M74))), \"\")","v":""},{"$f":"IFERROR(INDEX($G$2:$G$1840,_xlfn.AGGREGATE(15,3,(($A$2:$A$1840=$N$3)/($A$2:$A$1840=$N$3)*ROW($A$2:$A$1840))-ROW($A$1), ROWS($M$3:M74))), \"\")","v":""},""]
["0020","Barnstable United Elementary School","00200050",null,"03 - 05","SW",696,null,"ES",303,484.8,null,null,null,{"$f":"IFERROR((RANK(T75,$T$3:$T$191,0)+COUNTIF($T$3:T75, T75)-1), \"\")","v":""},{"$f":"IFERROR(INDEX($C$2:$C$1840,_xlfn.AGGREGATE(15,3,(($A$2:$A$1840=$N$3)/($A$2:$A$1840=$N$3)*ROW($A$2:$A$1840))-ROW($A$1), ROWS($M$3:M75))), \"\")","v":""},{"$f":"IFERROR(INDEX($B$2:$B$1840,_xlfn.AGGREGATE(15,3,(($A$2:$A$1840=$N$3)/($A$2:$A$1840=$N$3)*ROW($A$2:$A$1840))-ROW($A$1), ROWS($M$3:M75))), \"\")","v":""},{"$f":"IFERROR(INDEX($J$2:$J$1840,_xlfn.AGGREGATE(15,3,(($A$2:$A$1840=$N$3)/($A$2:$A$1840=$N$3)*ROW($A$2:$A$1840))-ROW($A$1), ROWS($M$3:M75))), \"\")","v":""},{"$f":"IFERROR(INDEX($G$2:$G$1840,_xlfn.AGGREGATE(15,3,(($A$2:$A$1840=$N$3)/($A$2:$A$1840=$N$3)*ROW($A$2:$A$1840))-ROW($A$1), ROWS($M$3:M75))), \"\")","v":""},""]
["0020","Barnstable Intermediate School","00200315",null,"06 - 07","NT",703,null,"MS",314,502.40000000000003,null,null,null,{"$f":"IFERROR((RANK(T76,$T$3:$T$191,0)+COUNTIF($T$3:T76, T76)-1), \"\")","v":""},{"$f":"IFERROR(INDEX($C$2:$C$1840,_xlfn.AGGREGATE(15,3,(($A$2:$A$1840=$N$3)/($A$2:$A$1840=$N$3)*ROW($A$2:$A$1840))-ROW($A$1), ROWS($M$3:M76))), \"\")","v":""},{"$f":"IFERROR(INDEX($B$2:$B$1840,_xlfn.AGGREGATE(15,3,(($A$2:$A$1840=$N$3)/($A$2:$A$1840=$N$3)*ROW($A$2:$A$1840))-ROW($A$1), ROWS($M$3:M76))), \"\")","v":""},{"$f":"IFERROR(INDEX($J$2:$J$1840,_xlfn.AGGREGATE(15,3,(($A$2:$A$1840=$N$3)/($A$2:$A$1840=$N$3)*ROW($A$2:$A$1840))-ROW($A$1), ROWS($M$3:M76))), \"\")","v":""},{"$f":"IFERROR(INDEX($G$2:$G$1840,_xlfn.AGGREGATE(15,3,(($A$2:$A$1840=$N$3)/($A$2:$A$1840=$N$3)*ROW($A$2:$A$1840))-ROW($A$1), ROWS($M$3:M76))), \"\")","v":""},""]
["0020","Barnstable High","00200505",null,"08 - 12","NT",1768,null,"MSHS/K-12",686,1089.6000000000001,null,null,null,{"$f":"IFERROR((RANK(T77,$T$3:$T$191,0)+COUNTIF($T$3:T77, T77)-1), \"\")","v":""},{"$f":"IFERROR(INDEX($C$2:$C$1840,_xlfn.AGGREGATE(15,3,(($A$2:$A$1840=$N$3)/($A$2:$A$1840=$N$3)*ROW($A$2:$A$1840))-ROW($A$1), ROWS($M$3:M77))), \"\")","v":""},{"$f":"IFERROR(INDEX($B$2:$B$1840,_xlfn.AGGREGATE(15,3,(($A$2:$A$1840=$N$3)/($A$2:$A$1840=$N$3)*ROW($A$2:$A$1840))-ROW($A$1), ROWS($M$3:M77))), \"\")","v":""},{"$f":"IFERROR(INDEX($J$2:$J$1840,_xlfn.AGGREGATE(15,3,(($A$2:$A$1840=$N$3)/($A$2:$A$1840=$N$3)*ROW($A$2:$A$1840))-ROW($A$1), ROWS($M$3:M77))), \"\")","v":""},{"$f":"IFERROR(INDEX($G$2:$G$1840,_xlfn.AGGREGATE(15,3,(($A$2:$A$1840=$N$3)/($A$2:$A$1840=$N$3)*ROW($A$2:$A$1840))-ROW($A$1), ROWS($M$3:M77))), \"\")","v":""},""]
["0023","Lt Elezer Davis","00230010",null,"PK - 02","TA",573,null,"EES",58,81.600000000000009,null,null,null,{"$f":"IFERROR((RANK(T78,$T$3:$T$191,0)+COUNTIF($T$3:T78, T78)-1), \"\")","v":""},{"$f":"IFERROR(INDEX($C$2:$C$1840,_xlfn.AGGREGATE(15,3,(($A$2:$A$1840=$N$3)/($A$2:$A$1840=$N$3)*ROW($A$2:$A$1840))-ROW($A$1), ROWS($M$3:M78))), \"\")","v":""},{"$f":"IFERROR(INDEX($B$2:$B$1840,_xlfn.AGGREGATE(15,3,(($A$2:$A$1840=$N$3)/($A$2:$A$1840=$N$3)*ROW($A$2:$A$1840))-ROW($A$1), ROWS($M$3:M78))), \"\")","v":""},{"$f":"IFERROR(INDEX($J$2:$J$1840,_xlfn.AGGREGATE(15,3,(($A$2:$A$1840=$N$3)/($A$2:$A$1840=$N$3)*ROW($A$2:$A$1840))-ROW($A$1), ROWS($M$3:M78))), \"\")","v":""},{"$f":"IFERROR(INDEX($G$2:$G$1840,_xlfn.AGGREGATE(15,3,(($A$2:$A$1840=$N$3)/($A$2:$A$1840=$N$3)*ROW($A$2:$A$1840))-ROW($A$1), ROWS($M$3:M78))), \"\")","v":""},""]
["0023","Lt Job Lane School","00230012",null,"03 - 05","TA",592,null,"ES",68,108.80000000000001,null,null,null,{"$f":"IFERROR((RANK(T79,$T$3:$T$191,0)+COUNTIF($T$3:T79, T79)-1), \"\")","v":""},{"$f":"IFERROR(INDEX($C$2:$C$1840,_xlfn.AGGREGATE(15,3,(($A$2:$A$1840=$N$3)/($A$2:$A$1840=$N$3)*ROW($A$2:$A$1840))-ROW($A$1), ROWS($M$3:M79))), \"\")","v":""},{"$f":"IFERROR(INDEX($B$2:$B$1840,_xlfn.AGGREGATE(15,3,(($A$2:$A$1840=$N$3)/($A$2:$A$1840=$N$3)*ROW($A$2:$A$1840))-ROW($A$1), ROWS($M$3:M79))), \"\")","v":""},{"$f":"IFERROR(INDEX($J$2:$J$1840,_xlfn.AGGREGATE(15,3,(($A$2:$A$1840=$N$3)/($A$2:$A$1840=$N$3)*ROW($A$2:$A$1840))-ROW($A$1), ROWS($M$3:M79))), \"\")","v":""},{"$f":"IFERROR(INDEX($G$2:$G$1840,_xlfn.AGGREGATE(15,3,(($A$2:$A$1840=$N$3)/($A$2:$A$1840=$N$3)*ROW($A$2:$A$1840))-ROW($A$1), ROWS($M$3:M79))), \"\")","v":""},""]
["0023","John Glenn Middle","00230305",null,"06 - 08","TA",614,null,"MS",66,105.60000000000001,null,null,null,{"$f":"IFERROR((RANK(T80,$T$3:$T$191,0)+COUNTIF($T$3:T80, T80)-1), \"\")","v":""},{"$f":"IFERROR(INDEX($C$2:$C$1840,_xlfn.AGGREGATE(15,3,(($A$2:$A$1840=$N$3)/($A$2:$A$1840=$N$3)*ROW($A$2:$A$1840))-ROW($A$1), ROWS($M$3:M80))), \"\")","v":""},{"$f":"IFERROR(INDEX($B$2:$B$1840,_xlfn.AGGREGATE(15,3,(($A$2:$A$1840=$N$3)/($A$2:$A$1840=$N$3)*ROW($A$2:$A$1840))-ROW($A$1), ROWS($M$3:M80))), \"\")","v":""},{"$f":"IFERROR(INDEX($J$2:$J$1840,_xlfn.AGGREGATE(15,3,(($A$2:$A$1840=$N$3)/($A$2:$A$1840=$N$3)*ROW($A$2:$A$1840))-ROW($A$1), ROWS($M$3:M80))), \"\")","v":""},{"$f":"IFERROR(INDEX($G$2:$G$1840,_xlfn.AGGREGATE(15,3,(($A$2:$A$1840=$N$3)/($A$2:$A$1840=$N$3)*ROW($A$2:$A$1840))-ROW($A$1), ROWS($M$3:M80))), \"\")","v":""},""]
["0023","Bedford High","00230505",null,"09 - 12","NT",822,null,"HS",92,147.20000000000002,null,null,null,{"$f":"IFERROR((RANK(T81,$T$3:$T$191,0)+COUNTIF($T$3:T81, T81)-1), \"\")","v":""},{"$f":"IFERROR(INDEX($C$2:$C$1840,_xlfn.AGGREGATE(15,3,(($A$2:$A$1840=$N$3)/($A$2:$A$1840=$N$3)*ROW($A$2:$A$1840))-ROW($A$1), ROWS($M$3:M81))), \"\")","v":""},{"$f":"IFERROR(INDEX($B$2:$B$1840,_xlfn.AGGREGATE(15,3,(($A$2:$A$1840=$N$3)/($A$2:$A$1840=$N$3)*ROW($A$2:$A$1840))-ROW($A$1), ROWS($M$3:M81))), \"\")","v":""},{"$f":"IFERROR(INDEX($J$2:$J$1840,_xlfn.AGGREGATE(15,3,(($A$2:$A$1840=$N$3)/($A$2:$A$1840=$N$3)*ROW($A$2:$A$1840))-ROW($A$1), ROWS($M$3:M81))), \"\")","v":""},{"$f":"IFERROR(INDEX($G$2:$G$1840,_xlfn.AGGREGATE(15,3,(($A$2:$A$1840=$N$3)/($A$2:$A$1840=$N$3)*ROW($A$2:$A$1840))-ROW($A$1), ROWS($M$3:M81))), \"\")","v":""},""]
["0024","Cold Spring","00240005",null,"PK - K","NT",180,null,"EES",47,67.2,null,null,null,{"$f":"IFERROR((RANK(T82,$T$3:$T$191,0)+COUNTIF($T$3:T82, T82)-1), \"\")","v":""},{"$f":"IFERROR(INDEX($C$2:$C$1840,_xlfn.AGGREGATE(15,3,(($A$2:$A$1840=$N$3)/($A$2:$A$1840=$N$3)*ROW($A$2:$A$1840))-ROW($A$1), ROWS($M$3:M82))), \"\")","v":""},{"$f":"IFERROR(INDEX($B$2:$B$1840,_xlfn.AGGREGATE(15,3,(($A$2:$A$1840=$N$3)/($A$2:$A$1840=$N$3)*ROW($A$2:$A$1840))-ROW($A$1), ROWS($M$3:M82))), \"\")","v":""},{"$f":"IFERROR(INDEX($J$2:$J$1840,_xlfn.AGGREGATE(15,3,(($A$2:$A$1840=$N$3)/($A$2:$A$1840=$N$3)*ROW($A$2:$A$1840))-ROW($A$1), ROWS($M$3:M82))), \"\")","v":""},{"$f":"IFERROR(INDEX($G$2:$G$1840,_xlfn.AGGREGATE(15,3,(($A$2:$A$1840=$N$3)/($A$2:$A$1840=$N$3)*ROW($A$2:$A$1840))-ROW($A$1), ROWS($M$3:M82))), \"\")","v":""},""]
["0024","Chestnut Hill Community School","00240006",null,"04 - 06","NT",484,null,"ES",115,184,null,null,null,{"$f":"IFERROR((RANK(T83,$T$3:$T$191,0)+COUNTIF($T$3:T83, T83)-1), \"\")","v":""},{"$f":"IFERROR(INDEX($C$2:$C$1840,_xlfn.AGGREGATE(15,3,(($A$2:$A$1840=$N$3)/($A$2:$A$1840=$N$3)*ROW($A$2:$A$1840))-ROW($A$1), ROWS($M$3:M83))), \"\")","v":""},{"$f":"IFERROR(INDEX($B$2:$B$1840,_xlfn.AGGREGATE(15,3,(($A$2:$A$1840=$N$3)/($A$2:$A$1840=$N$3)*ROW($A$2:$A$1840))-ROW($A$1), ROWS($M$3:M83))), \"\")","v":""},{"$f":"IFERROR(INDEX($J$2:$J$1840,_xlfn.AGGREGATE(15,3,(($A$2:$A$1840=$N$3)/($A$2:$A$1840=$N$3)*ROW($A$2:$A$1840))-ROW($A$1), ROWS($M$3:M83))), \"\")","v":""},{"$f":"IFERROR(INDEX($G$2:$G$1840,_xlfn.AGGREGATE(15,3,(($A$2:$A$1840=$N$3)/($A$2:$A$1840=$N$3)*ROW($A$2:$A$1840))-ROW($A$1), ROWS($M$3:M83))), \"\")","v":""},""]
["0024","Swift River Elementary","00240018",null,"01 - 03","TA",444,null,"ES",108,172.8,null,null,null,{"$f":"IFERROR((RANK(T84,$T$3:$T$191,0)+COUNTIF($T$3:T84, T84)-1), \"\")","v":""},{"$f":"IFERROR(INDEX($C$2:$C$1840,_xlfn.AGGREGATE(15,3,(($A$2:$A$1840=$N$3)/($A$2:$A$1840=$N$3)*ROW($A$2:$A$1840))-ROW($A$1), ROWS($M$3:M84))), \"\")","v":""},{"$f":"IFERROR(INDEX($B$2:$B$1840,_xlfn.AGGREGATE(15,3,(($A$2:$A$1840=$N$3)/($A$2:$A$1840=$N$3)*ROW($A$2:$A$1840))-ROW($A$1), ROWS($M$3:M84))), \"\")","v":""},{"$f":"IFERROR(INDEX($J$2:$J$1840,_xlfn.AGGREGATE(15,3,(($A$2:$A$1840=$N$3)/($A$2:$A$1840=$N$3)*ROW($A$2:$A$1840))-ROW($A$1), ROWS($M$3:M84))), \"\")","v":""},{"$f":"IFERROR(INDEX($G$2:$G$1840,_xlfn.AGGREGATE(15,3,(($A$2:$A$1840=$N$3)/($A$2:$A$1840=$N$3)*ROW($A$2:$A$1840))-ROW($A$1), ROWS($M$3:M84))), \"\")","v":""},""]
["0024","Jabish Middle School","00240025",null,"07 - 08","NT",356,null,"MS",73,116.80000000000001,null,null,null,{"$f":"IFERROR((RANK(T85,$T$3:$T$191,0)+COUNTIF($T$3:T85, T85)-1), \"\")","v":""},{"$f":"IFERROR(INDEX($C$2:$C$1840,_xlfn.AGGREGATE(15,3,(($A$2:$A$1840=$N$3)/($A$2:$A$1840=$N$3)*ROW($A$2:$A$1840))-ROW($A$1), ROWS($M$3:M85))), \"\")","v":""},{"$f":"IFERROR(INDEX($B$2:$B$1840,_xlfn.AGGREGATE(15,3,(($A$2:$A$1840=$N$3)/($A$2:$A$1840=$N$3)*ROW($A$2:$A$1840))-ROW($A$1), ROWS($M$3:M85))), \"\")","v":""},{"$f":"IFERROR(INDEX($J$2:$J$1840,_xlfn.AGGREGATE(15,3,(($A$2:$A$1840=$N$3)/($A$2:$A$1840=$N$3)*ROW($A$2:$A$1840))-ROW($A$1), ROWS($M$3:M85))), \"\")","v":""},{"$f":"IFERROR(INDEX($G$2:$G$1840,_xlfn.AGGREGATE(15,3,(($A$2:$A$1840=$N$3)/($A$2:$A$1840=$N$3)*ROW($A$2:$A$1840))-ROW($A$1), ROWS($M$3:M85))), \"\")","v":""},""]
["0024","Belchertown High","00240505",null,"09 - 12","NT",695,null,"HS",132,206.4,null,null,null,{"$f":"IFERROR((RANK(T86,$T$3:$T$191,0)+COUNTIF($T$3:T86, T86)-1), \"\")","v":""},{"$f":"IFERROR(INDEX($C$2:$C$1840,_xlfn.AGGREGATE(15,3,(($A$2:$A$1840=$N$3)/($A$2:$A$1840=$N$3)*ROW($A$2:$A$1840))-ROW($A$1), ROWS($M$3:M86))), \"\")","v":""},{"$f":"IFERROR(INDEX($B$2:$B$1840,_xlfn.AGGREGATE(15,3,(($A$2:$A$1840=$N$3)/($A$2:$A$1840=$N$3)*ROW($A$2:$A$1840))-ROW($A$1), ROWS($M$3:M86))), \"\")","v":""},{"$f":"IFERROR(INDEX($J$2:$J$1840,_xlfn.AGGREGATE(15,3,(($A$2:$A$1840=$N$3)/($A$2:$A$1840=$N$3)*ROW($A$2:$A$1840))-ROW($A$1), ROWS($M$3:M86))), \"\")","v":""},{"$f":"IFERROR(INDEX($G$2:$G$1840,_xlfn.AGGREGATE(15,3,(($A$2:$A$1840=$N$3)/($A$2:$A$1840=$N$3)*ROW($A$2:$A$1840))-ROW($A$1), ROWS($M$3:M86))), \"\")","v":""},""]
["0025","Bellingham Early Childhood Center","00250003",null,"PK","NT",63,null,"EES",18,0,null,null,null,{"$f":"IFERROR((RANK(T87,$T$3:$T$191,0)+COUNTIF($T$3:T87, T87)-1), \"\")","v":""},{"$f":"IFERROR(INDEX($C$2:$C$1840,_xlfn.AGGREGATE(15,3,(($A$2:$A$1840=$N$3)/($A$2:$A$1840=$N$3)*ROW($A$2:$A$1840))-ROW($A$1), ROWS($M$3:M87))), \"\")","v":""},{"$f":"IFERROR(INDEX($B$2:$B$1840,_xlfn.AGGREGATE(15,3,(($A$2:$A$1840=$N$3)/($A$2:$A$1840=$N$3)*ROW($A$2:$A$1840))-ROW($A$1), ROWS($M$3:M87))), \"\")","v":""},{"$f":"IFERROR(INDEX($J$2:$J$1840,_xlfn.AGGREGATE(15,3,(($A$2:$A$1840=$N$3)/($A$2:$A$1840=$N$3)*ROW($A$2:$A$1840))-ROW($A$1), ROWS($M$3:M87))), \"\")","v":""},{"$f":"IFERROR(INDEX($G$2:$G$1840,_xlfn.AGGREGATE(15,3,(($A$2:$A$1840=$N$3)/($A$2:$A$1840=$N$3)*ROW($A$2:$A$1840))-ROW($A$1), ROWS($M$3:M87))), \"\")","v":""},""]
["0025","Joseph F DiPietro Elementary School","00250020",null,"K - 03","SW",284,null,"ES",89,142.4,null,null,null,{"$f":"IFERROR((RANK(T88,$T$3:$T$191,0)+COUNTIF($T$3:T88, T88)-1), \"\")","v":""},{"$f":"IFERROR(INDEX($C$2:$C$1840,_xlfn.AGGREGATE(15,3,(($A$2:$A$1840=$N$3)/($A$2:$A$1840=$N$3)*ROW($A$2:$A$1840))-ROW($A$1), ROWS($M$3:M88))), \"\")","v":""},{"$f":"IFERROR(INDEX($B$2:$B$1840,_xlfn.AGGREGATE(15,3,(($A$2:$A$1840=$N$3)/($A$2:$A$1840=$N$3)*ROW($A$2:$A$1840))-ROW($A$1), ROWS($M$3:M88))), \"\")","v":""},{"$f":"IFERROR(INDEX($J$2:$J$1840,_xlfn.AGGREGATE(15,3,(($A$2:$A$1840=$N$3)/($A$2:$A$1840=$N$3)*ROW($A$2:$A$1840))-ROW($A$1), ROWS($M$3:M88))), \"\")","v":""},{"$f":"IFERROR(INDEX($G$2:$G$1840,_xlfn.AGGREGATE(15,3,(($A$2:$A$1840=$N$3)/($A$2:$A$1840=$N$3)*ROW($A$2:$A$1840))-ROW($A$1), ROWS($M$3:M88))), \"\")","v":""},""]
["0025","Stall Brook","00250025",null,"K - 03","SW",239,null,"ES",63,100.80000000000001,null,null,null,{"$f":"IFERROR((RANK(T89,$T$3:$T$191,0)+COUNTIF($T$3:T89, T89)-1), \"\")","v":""},{"$f":"IFERROR(INDEX($C$2:$C$1840,_xlfn.AGGREGATE(15,3,(($A$2:$A$1840=$N$3)/($A$2:$A$1840=$N$3)*ROW($A$2:$A$1840))-ROW($A$1), ROWS($M$3:M89))), \"\")","v":""},{"$f":"IFERROR(INDEX($B$2:$B$1840,_xlfn.AGGREGATE(15,3,(($A$2:$A$1840=$N$3)/($A$2:$A$1840=$N$3)*ROW($A$2:$A$1840))-ROW($A$1), ROWS($M$3:M89))), \"\")","v":""},{"$f":"IFERROR(INDEX($J$2:$J$1840,_xlfn.AGGREGATE(15,3,(($A$2:$A$1840=$N$3)/($A$2:$A$1840=$N$3)*ROW($A$2:$A$1840))-ROW($A$1), ROWS($M$3:M89))), \"\")","v":""},{"$f":"IFERROR(INDEX($G$2:$G$1840,_xlfn.AGGREGATE(15,3,(($A$2:$A$1840=$N$3)/($A$2:$A$1840=$N$3)*ROW($A$2:$A$1840))-ROW($A$1), ROWS($M$3:M89))), \"\")","v":""},""]
["0025","Bellingham Memorial School","00250315",null,"04 - 07","NT",647,null,"ESMS",159,254.4,null,null,null,{"$f":"IFERROR((RANK(T90,$T$3:$T$191,0)+COUNTIF($T$3:T90, T90)-1), \"\")","v":""},{"$f":"IFERROR(INDEX($C$2:$C$1840,_xlfn.AGGREGATE(15,3,(($A$2:$A$1840=$N$3)/($A$2:$A$1840=$N$3)*ROW($A$2:$A$1840))-ROW($A$1), ROWS($M$3:M90))), \"\")","v":""},{"$f":"IFERROR(INDEX($B$2:$B$1840,_xlfn.AGGREGATE(15,3,(($A$2:$A$1840=$N$3)/($A$2:$A$1840=$N$3)*ROW($A$2:$A$1840))-ROW($A$1), ROWS($M$3:M90))), \"\")","v":""},{"$f":"IFERROR(INDEX($J$2:$J$1840,_xlfn.AGGREGATE(15,3,(($A$2:$A$1840=$N$3)/($A$2:$A$1840=$N$3)*ROW($A$2:$A$1840))-ROW($A$1), ROWS($M$3:M90))), \"\")","v":""},{"$f":"IFERROR(INDEX($G$2:$G$1840,_xlfn.AGGREGATE(15,3,(($A$2:$A$1840=$N$3)/($A$2:$A$1840=$N$3)*ROW($A$2:$A$1840))-ROW($A$1), ROWS($M$3:M90))), \"\")","v":""},""]
["0025","Bellingham High School","00250505",null,"08 - 12","NT",724,null,"MSHS/K-12",146,230.4,null,null,null,{"$f":"IFERROR((RANK(T91,$T$3:$T$191,0)+COUNTIF($T$3:T91, T91)-1), \"\")","v":""},{"$f":"IFERROR(INDEX($C$2:$C$1840,_xlfn.AGGREGATE(15,3,(($A$2:$A$1840=$N$3)/($A$2:$A$1840=$N$3)*ROW($A$2:$A$1840))-ROW($A$1), ROWS($M$3:M91))), \"\")","v":""},{"$f":"IFERROR(INDEX($B$2:$B$1840,_xlfn.AGGREGATE(15,3,(($A$2:$A$1840=$N$3)/($A$2:$A$1840=$N$3)*ROW($A$2:$A$1840))-ROW($A$1), ROWS($M$3:M91))), \"\")","v":""},{"$f":"IFERROR(INDEX($J$2:$J$1840,_xlfn.AGGREGATE(15,3,(($A$2:$A$1840=$N$3)/($A$2:$A$1840=$N$3)*ROW($A$2:$A$1840))-ROW($A$1), ROWS($M$3:M91))), \"\")","v":""},{"$f":"IFERROR(INDEX($G$2:$G$1840,_xlfn.AGGREGATE(15,3,(($A$2:$A$1840=$N$3)/($A$2:$A$1840=$N$3)*ROW($A$2:$A$1840))-ROW($A$1), ROWS($M$3:M91))), \"\")","v":""},""]
["0025","Keough Memorial Academy","00250510",null,"07 - 12","NT",26,null,"MSHS/K-12",12,19.200000000000003,null,null,null,{"$f":"IFERROR((RANK(T92,$T$3:$T$191,0)+COUNTIF($T$3:T92, T92)-1), \"\")","v":""},{"$f":"IFERROR(INDEX($C$2:$C$1840,_xlfn.AGGREGATE(15,3,(($A$2:$A$1840=$N$3)/($A$2:$A$1840=$N$3)*ROW($A$2:$A$1840))-ROW($A$1), ROWS($M$3:M92))), \"\")","v":""},{"$f":"IFERROR(INDEX($B$2:$B$1840,_xlfn.AGGREGATE(15,3,(($A$2:$A$1840=$N$3)/($A$2:$A$1840=$N$3)*ROW($A$2:$A$1840))-ROW($A$1), ROWS($M$3:M92))), \"\")","v":""},{"$f":"IFERROR(INDEX($J$2:$J$1840,_xlfn.AGGREGATE(15,3,(($A$2:$A$1840=$N$3)/($A$2:$A$1840=$N$3)*ROW($A$2:$A$1840))-ROW($A$1), ROWS($M$3:M92))), \"\")","v":""},{"$f":"IFERROR(INDEX($G$2:$G$1840,_xlfn.AGGREGATE(15,3,(($A$2:$A$1840=$N$3)/($A$2:$A$1840=$N$3)*ROW($A$2:$A$1840))-ROW($A$1), ROWS($M$3:M92))), \"\")","v":""},""]
["0026","Winn Brook","00260005",null,"K - 04","NT",424,null,"ES",9,14.4,null,null,null,{"$f":"IFERROR((RANK(T93,$T$3:$T$191,0)+COUNTIF($T$3:T93, T93)-1), \"\")","v":""},{"$f":"IFERROR(INDEX($C$2:$C$1840,_xlfn.AGGREGATE(15,3,(($A$2:$A$1840=$N$3)/($A$2:$A$1840=$N$3)*ROW($A$2:$A$1840))-ROW($A$1), ROWS($M$3:M93))), \"\")","v":""},{"$f":"IFERROR(INDEX($B$2:$B$1840,_xlfn.AGGREGATE(15,3,(($A$2:$A$1840=$N$3)/($A$2:$A$1840=$N$3)*ROW($A$2:$A$1840))-ROW($A$1), ROWS($M$3:M93))), \"\")","v":""},{"$f":"IFERROR(INDEX($J$2:$J$1840,_xlfn.AGGREGATE(15,3,(($A$2:$A$1840=$N$3)/($A$2:$A$1840=$N$3)*ROW($A$2:$A$1840))-ROW($A$1), ROWS($M$3:M93))), \"\")","v":""},{"$f":"IFERROR(INDEX($G$2:$G$1840,_xlfn.AGGREGATE(15,3,(($A$2:$A$1840=$N$3)/($A$2:$A$1840=$N$3)*ROW($A$2:$A$1840))-ROW($A$1), ROWS($M$3:M93))), \"\")","v":""},""]
["0026","Mary Lee Burbank","00260010",null,"K - 04","TA",372,null,"ES",26,41.6,null,null,null,{"$f":"IFERROR((RANK(T94,$T$3:$T$191,0)+COUNTIF($T$3:T94, T94)-1), \"\")","v":""},{"$f":"IFERROR(INDEX($C$2:$C$1840,_xlfn.AGGREGATE(15,3,(($A$2:$A$1840=$N$3)/($A$2:$A$1840=$N$3)*ROW($A$2:$A$1840))-ROW($A$1), ROWS($M$3:M94))), \"\")","v":""},{"$f":"IFERROR(INDEX($B$2:$B$1840,_xlfn.AGGREGATE(15,3,(($A$2:$A$1840=$N$3)/($A$2:$A$1840=$N$3)*ROW($A$2:$A$1840))-ROW($A$1), ROWS($M$3:M94))), \"\")","v":""},{"$f":"IFERROR(INDEX($J$2:$J$1840,_xlfn.AGGREGATE(15,3,(($A$2:$A$1840=$N$3)/($A$2:$A$1840=$N$3)*ROW($A$2:$A$1840))-ROW($A$1), ROWS($M$3:M94))), \"\")","v":""},{"$f":"IFERROR(INDEX($G$2:$G$1840,_xlfn.AGGREGATE(15,3,(($A$2:$A$1840=$N$3)/($A$2:$A$1840=$N$3)*ROW($A$2:$A$1840))-ROW($A$1), ROWS($M$3:M94))), \"\")","v":""},""]
["0026","Daniel Butler","00260015",null,"K - 04","TA",330,null,"ES",31,49.6,null,null,null,{"$f":"IFERROR((RANK(T95,$T$3:$T$191,0)+COUNTIF($T$3:T95, T95)-1), \"\")","v":""},{"$f":"IFERROR(INDEX($C$2:$C$1840,_xlfn.AGGREGATE(15,3,(($A$2:$A$1840=$N$3)/($A$2:$A$1840=$N$3)*ROW($A$2:$A$1840))-ROW($A$1), ROWS($M$3:M95))), \"\")","v":""},{"$f":"IFERROR(INDEX($B$2:$B$1840,_xlfn.AGGREGATE(15,3,(($A$2:$A$1840=$N$3)/($A$2:$A$1840=$N$3)*ROW($A$2:$A$1840))-ROW($A$1), ROWS($M$3:M95))), \"\")","v":""},{"$f":"IFERROR(INDEX($J$2:$J$1840,_xlfn.AGGREGATE(15,3,(($A$2:$A$1840=$N$3)/($A$2:$A$1840=$N$3)*ROW($A$2:$A$1840))-ROW($A$1), ROWS($M$3:M95))), \"\")","v":""},{"$f":"IFERROR(INDEX($G$2:$G$1840,_xlfn.AGGREGATE(15,3,(($A$2:$A$1840=$N$3)/($A$2:$A$1840=$N$3)*ROW($A$2:$A$1840))-ROW($A$1), ROWS($M$3:M95))), \"\")","v":""},""]
["0026","Roger E Wellington","00260035",null,"PK - 04","TA",578,null,"ES",71,96,null,null,null,{"$f":"IFERROR((RANK(T96,$T$3:$T$191,0)+COUNTIF($T$3:T96, T96)-1), \"\")","v":""},{"$f":"IFERROR(INDEX($C$2:$C$1840,_xlfn.AGGREGATE(15,3,(($A$2:$A$1840=$N$3)/($A$2:$A$1840=$N$3)*ROW($A$2:$A$1840))-ROW($A$1), ROWS($M$3:M96))), \"\")","v":""},{"$f":"IFERROR(INDEX($B$2:$B$1840,_xlfn.AGGREGATE(15,3,(($A$2:$A$1840=$N$3)/($A$2:$A$1840=$N$3)*ROW($A$2:$A$1840))-ROW($A$1), ROWS($M$3:M96))), \"\")","v":""},{"$f":"IFERROR(INDEX($J$2:$J$1840,_xlfn.AGGREGATE(15,3,(($A$2:$A$1840=$N$3)/($A$2:$A$1840=$N$3)*ROW($A$2:$A$1840))-ROW($A$1), ROWS($M$3:M96))), \"\")","v":""},{"$f":"IFERROR(INDEX($G$2:$G$1840,_xlfn.AGGREGATE(15,3,(($A$2:$A$1840=$N$3)/($A$2:$A$1840=$N$3)*ROW($A$2:$A$1840))-ROW($A$1), ROWS($M$3:M96))), \"\")","v":""},""]
["0026","Winthrop L Chenery Middle","00260305",null,"05 - 08","NT",1409,null,"MS",127,203.20000000000002,null,null,null,{"$f":"IFERROR((RANK(T97,$T$3:$T$191,0)+COUNTIF($T$3:T97, T97)-1), \"\")","v":""},{"$f":"IFERROR(INDEX($C$2:$C$1840,_xlfn.AGGREGATE(15,3,(($A$2:$A$1840=$N$3)/($A$2:$A$1840=$N$3)*ROW($A$2:$A$1840))-ROW($A$1), ROWS($M$3:M97))), \"\")","v":""},{"$f":"IFERROR(INDEX($B$2:$B$1840,_xlfn.AGGREGATE(15,3,(($A$2:$A$1840=$N$3)/($A$2:$A$1840=$N$3)*ROW($A$2:$A$1840))-ROW($A$1), ROWS($M$3:M97))), \"\")","v":""},{"$f":"IFERROR(INDEX($J$2:$J$1840,_xlfn.AGGREGATE(15,3,(($A$2:$A$1840=$N$3)/($A$2:$A$1840=$N$3)*ROW($A$2:$A$1840))-ROW($A$1), ROWS($M$3:M97))), \"\")","v":""},{"$f":"IFERROR(INDEX($G$2:$G$1840,_xlfn.AGGREGATE(15,3,(($A$2:$A$1840=$N$3)/($A$2:$A$1840=$N$3)*ROW($A$2:$A$1840))-ROW($A$1), ROWS($M$3:M97))), \"\")","v":""},""]
["0026","Belmont High","00260505",null,"09 - 12","NT",1301,null,"HS",118,188.8,null,null,null,{"$f":"IFERROR((RANK(T98,$T$3:$T$191,0)+COUNTIF($T$3:T98, T98)-1), \"\")","v":""},{"$f":"IFERROR(INDEX($C$2:$C$1840,_xlfn.AGGREGATE(15,3,(($A$2:$A$1840=$N$3)/($A$2:$A$1840=$N$3)*ROW($A$2:$A$1840))-ROW($A$1), ROWS($M$3:M98))), \"\")","v":""},{"$f":"IFERROR(INDEX($B$2:$B$1840,_xlfn.AGGREGATE(15,3,(($A$2:$A$1840=$N$3)/($A$2:$A$1840=$N$3)*ROW($A$2:$A$1840))-ROW($A$1), ROWS($M$3:M98))), \"\")","v":""},{"$f":"IFERROR(INDEX($J$2:$J$1840,_xlfn.AGGREGATE(15,3,(($A$2:$A$1840=$N$3)/($A$2:$A$1840=$N$3)*ROW($A$2:$A$1840))-ROW($A$1), ROWS($M$3:M98))), \"\")","v":""},{"$f":"IFERROR(INDEX($G$2:$G$1840,_xlfn.AGGREGATE(15,3,(($A$2:$A$1840=$N$3)/($A$2:$A$1840=$N$3)*ROW($A$2:$A$1840))-ROW($A$1), ROWS($M$3:M98))), \"\")","v":""},""]
["0027","Berkley Community School","00270010",null,"PK - 04","TA",474,null,"ES",115,164.8,null,null,null,{"$f":"IFERROR((RANK(T99,$T$3:$T$191,0)+COUNTIF($T$3:T99, T99)-1), \"\")","v":""},{"$f":"IFERROR(INDEX($C$2:$C$1840,_xlfn.AGGREGATE(15,3,(($A$2:$A$1840=$N$3)/($A$2:$A$1840=$N$3)*ROW($A$2:$A$1840))-ROW($A$1), ROWS($M$3:M99))), \"\")","v":""},{"$f":"IFERROR(INDEX($B$2:$B$1840,_xlfn.AGGREGATE(15,3,(($A$2:$A$1840=$N$3)/($A$2:$A$1840=$N$3)*ROW($A$2:$A$1840))-ROW($A$1), ROWS($M$3:M99))), \"\")","v":""},{"$f":"IFERROR(INDEX($J$2:$J$1840,_xlfn.AGGREGATE(15,3,(($A$2:$A$1840=$N$3)/($A$2:$A$1840=$N$3)*ROW($A$2:$A$1840))-ROW($A$1), ROWS($M$3:M99))), \"\")","v":""},{"$f":"IFERROR(INDEX($G$2:$G$1840,_xlfn.AGGREGATE(15,3,(($A$2:$A$1840=$N$3)/($A$2:$A$1840=$N$3)*ROW($A$2:$A$1840))-ROW($A$1), ROWS($M$3:M99))), \"\")","v":""},""]
["0027","Berkley Middle School","00270305",null,"05 - 08","NT",394,null,"MS",74,118.4,null,null,null,{"$f":"IFERROR((RANK(T100,$T$3:$T$191,0)+COUNTIF($T$3:T100, T100)-1), \"\")","v":""},{"$f":"IFERROR(INDEX($C$2:$C$1840,_xlfn.AGGREGATE(15,3,(($A$2:$A$1840=$N$3)/($A$2:$A$1840=$N$3)*ROW($A$2:$A$1840))-ROW($A$1), ROWS($M$3:M100))), \"\")","v":""},{"$f":"IFERROR(INDEX($B$2:$B$1840,_xlfn.AGGREGATE(15,3,(($A$2:$A$1840=$N$3)/($A$2:$A$1840=$N$3)*ROW($A$2:$A$1840))-ROW($A$1), ROWS($M$3:M100))), \"\")","v":""},{"$f":"IFERROR(INDEX($J$2:$J$1840,_xlfn.AGGREGATE(15,3,(($A$2:$A$1840=$N$3)/($A$2:$A$1840=$N$3)*ROW($A$2:$A$1840))-ROW($A$1), ROWS($M$3:M100))), \"\")","v":""},{"$f":"IFERROR(INDEX($G$2:$G$1840,_xlfn.AGGREGATE(15,3,(($A$2:$A$1840=$N$3)/($A$2:$A$1840=$N$3)*ROW($A$2:$A$1840))-ROW($A$1), ROWS($M$3:M100))), \"\")","v":""},""]
["0030","McKeown School","00300002",null,"PK","NT",101,null,"EES",33,0,null,null,null,{"$f":"IFERROR((RANK(T101,$T$3:$T$191,0)+COUNTIF($T$3:T101, T101)-1), \"\")","v":""},{"$f":"IFERROR(INDEX($C$2:$C$1840,_xlfn.AGGREGATE(15,3,(($A$2:$A$1840=$N$3)/($A$2:$A$1840=$N$3)*ROW($A$2:$A$1840))-ROW($A$1), ROWS($M$3:M101))), \"\")","v":""},{"$f":"IFERROR(INDEX($B$2:$B$1840,_xlfn.AGGREGATE(15,3,(($A$2:$A$1840=$N$3)/($A$2:$A$1840=$N$3)*ROW($A$2:$A$1840))-ROW($A$1), ROWS($M$3:M101))), \"\")","v":""},{"$f":"IFERROR(INDEX($J$2:$J$1840,_xlfn.AGGREGATE(15,3,(($A$2:$A$1840=$N$3)/($A$2:$A$1840=$N$3)*ROW($A$2:$A$1840))-ROW($A$1), ROWS($M$3:M101))), \"\")","v":""},{"$f":"IFERROR(INDEX($G$2:$G$1840,_xlfn.AGGREGATE(15,3,(($A$2:$A$1840=$N$3)/($A$2:$A$1840=$N$3)*ROW($A$2:$A$1840))-ROW($A$1), ROWS($M$3:M101))), \"\")","v":""},""]
["0030","Centerville Elementary","00300010",null,"K - 04","SW",332,null,"ES",125,200,null,null,null,{"$f":"IFERROR((RANK(T102,$T$3:$T$191,0)+COUNTIF($T$3:T102, T102)-1), \"\")","v":""},{"$f":"IFERROR(INDEX($C$2:$C$1840,_xlfn.AGGREGATE(15,3,(($A$2:$A$1840=$N$3)/($A$2:$A$1840=$N$3)*ROW($A$2:$A$1840))-ROW($A$1), ROWS($M$3:M102))), \"\")","v":""},{"$f":"IFERROR(INDEX($B$2:$B$1840,_xlfn.AGGREGATE(15,3,(($A$2:$A$1840=$N$3)/($A$2:$A$1840=$N$3)*ROW($A$2:$A$1840))-ROW($A$1), ROWS($M$3:M102))), \"\")","v":""},{"$f":"IFERROR(INDEX($J$2:$J$1840,_xlfn.AGGREGATE(15,3,(($A$2:$A$1840=$N$3)/($A$2:$A$1840=$N$3)*ROW($A$2:$A$1840))-ROW($A$1), ROWS($M$3:M102))), \"\")","v":""},{"$f":"IFERROR(INDEX($G$2:$G$1840,_xlfn.AGGREGATE(15,3,(($A$2:$A$1840=$N$3)/($A$2:$A$1840=$N$3)*ROW($A$2:$A$1840))-ROW($A$1), ROWS($M$3:M102))), \"\")","v":""},""]
["0030","Cove Elementary","00300015",null,"K - 04","SW",402,null,"ES",139,222.4,null,null,null,{"$f":"IFERROR((RANK(T103,$T$3:$T$191,0)+COUNTIF($T$3:T103, T103)-1), \"\")","v":""},{"$f":"IFERROR(INDEX($C$2:$C$1840,_xlfn.AGGREGATE(15,3,(($A$2:$A$1840=$N$3)/($A$2:$A$1840=$N$3)*ROW($A$2:$A$1840))-ROW($A$1), ROWS($M$3:M103))), \"\")","v":""},{"$f":"IFERROR(INDEX($B$2:$B$1840,_xlfn.AGGREGATE(15,3,(($A$2:$A$1840=$N$3)/($A$2:$A$1840=$N$3)*ROW($A$2:$A$1840))-ROW($A$1), ROWS($M$3:M103))), \"\")","v":""},{"$f":"IFERROR(INDEX($J$2:$J$1840,_xlfn.AGGREGATE(15,3,(($A$2:$A$1840=$N$3)/($A$2:$A$1840=$N$3)*ROW($A$2:$A$1840))-ROW($A$1), ROWS($M$3:M103))), \"\")","v":""},{"$f":"IFERROR(INDEX($G$2:$G$1840,_xlfn.AGGREGATE(15,3,(($A$2:$A$1840=$N$3)/($A$2:$A$1840=$N$3)*ROW($A$2:$A$1840))-ROW($A$1), ROWS($M$3:M103))), \"\")","v":""},""]
["0030","Hannah Elementary","00300033",null,"K - 04","NT",324,null,"ES",77,123.2,null,null,null,{"$f":"IFERROR((RANK(T104,$T$3:$T$191,0)+COUNTIF($T$3:T104, T104)-1), \"\")","v":""},{"$f":"IFERROR(INDEX($C$2:$C$1840,_xlfn.AGGREGATE(15,3,(($A$2:$A$1840=$N$3)/($A$2:$A$1840=$N$3)*ROW($A$2:$A$1840))-ROW($A$1), ROWS($M$3:M104))), \"\")","v":""},{"$f":"IFERROR(INDEX($B$2:$B$1840,_xlfn.AGGREGATE(15,3,(($A$2:$A$1840=$N$3)/($A$2:$A$1840=$N$3)*ROW($A$2:$A$1840))-ROW($A$1), ROWS($M$3:M104))), \"\")","v":""},{"$f":"IFERROR(INDEX($J$2:$J$1840,_xlfn.AGGREGATE(15,3,(($A$2:$A$1840=$N$3)/($A$2:$A$1840=$N$3)*ROW($A$2:$A$1840))-ROW($A$1), ROWS($M$3:M104))), \"\")","v":""},{"$f":"IFERROR(INDEX($G$2:$G$1840,_xlfn.AGGREGATE(15,3,(($A$2:$A$1840=$N$3)/($A$2:$A$1840=$N$3)*ROW($A$2:$A$1840))-ROW($A$1), ROWS($M$3:M104))), \"\")","v":""},""]
["0030","North Beverly Elementary","00300040",null,"K - 04","SW",368,null,"ES",95,152,null,null,null,{"$f":"IFERROR((RANK(T105,$T$3:$T$191,0)+COUNTIF($T$3:T105, T105)-1), \"\")","v":""},{"$f":"IFERROR(INDEX($C$2:$C$1840,_xlfn.AGGREGATE(15,3,(($A$2:$A$1840=$N$3)/($A$2:$A$1840=$N$3)*ROW($A$2:$A$1840))-ROW($A$1), ROWS($M$3:M105))), \"\")","v":""},{"$f":"IFERROR(INDEX($B$2:$B$1840,_xlfn.AGGREGATE(15,3,(($A$2:$A$1840=$N$3)/($A$2:$A$1840=$N$3)*ROW($A$2:$A$1840))-ROW($A$1), ROWS($M$3:M105))), \"\")","v":""},{"$f":"IFERROR(INDEX($J$2:$J$1840,_xlfn.AGGREGATE(15,3,(($A$2:$A$1840=$N$3)/($A$2:$A$1840=$N$3)*ROW($A$2:$A$1840))-ROW($A$1), ROWS($M$3:M105))), \"\")","v":""},{"$f":"IFERROR(INDEX($G$2:$G$1840,_xlfn.AGGREGATE(15,3,(($A$2:$A$1840=$N$3)/($A$2:$A$1840=$N$3)*ROW($A$2:$A$1840))-ROW($A$1), ROWS($M$3:M105))), \"\")","v":""},""]
["0030","Ayers/Ryal Side School","00300055",null,"K - 04","SW",390,null,"ES",105,168,null,null,null,{"$f":"IFERROR((RANK(T106,$T$3:$T$191,0)+COUNTIF($T$3:T106, T106)-1), \"\")","v":""},{"$f":"IFERROR(INDEX($C$2:$C$1840,_xlfn.AGGREGATE(15,3,(($A$2:$A$1840=$N$3)/($A$2:$A$1840=$N$3)*ROW($A$2:$A$1840))-ROW($A$1), ROWS($M$3:M106))), \"\")","v":""},{"$f":"IFERROR(INDEX($B$2:$B$1840,_xlfn.AGGREGATE(15,3,(($A$2:$A$1840=$N$3)/($A$2:$A$1840=$N$3)*ROW($A$2:$A$1840))-ROW($A$1), ROWS($M$3:M106))), \"\")","v":""},{"$f":"IFERROR(INDEX($J$2:$J$1840,_xlfn.AGGREGATE(15,3,(($A$2:$A$1840=$N$3)/($A$2:$A$1840=$N$3)*ROW($A$2:$A$1840))-ROW($A$1), ROWS($M$3:M106))), \"\")","v":""},{"$f":"IFERROR(INDEX($G$2:$G$1840,_xlfn.AGGREGATE(15,3,(($A$2:$A$1840=$N$3)/($A$2:$A$1840=$N$3)*ROW($A$2:$A$1840))-ROW($A$1), ROWS($M$3:M106))), \"\")","v":""},""]
["0030","Beverly Middle School","00300305",null,"05 - 08","NT",1432,null,"MS",421,673.6,null,null,null,{"$f":"IFERROR((RANK(T107,$T$3:$T$191,0)+COUNTIF($T$3:T107, T107)-1), \"\")","v":""},{"$f":"IFERROR(INDEX($C$2:$C$1840,_xlfn.AGGREGATE(15,3,(($A$2:$A$1840=$N$3)/($A$2:$A$1840=$N$3)*ROW($A$2:$A$1840))-ROW($A$1), ROWS($M$3:M107))), \"\")","v":""},{"$f":"IFERROR(INDEX($B$2:$B$1840,_xlfn.AGGREGATE(15,3,(($A$2:$A$1840=$N$3)/($A$2:$A$1840=$N$3)*ROW($A$2:$A$1840))-ROW($A$1), ROWS($M$3:M107))), \"\")","v":""},{"$f":"IFERROR(INDEX($J$2:$J$1840,_xlfn.AGGREGATE(15,3,(($A$2:$A$1840=$N$3)/($A$2:$A$1840=$N$3)*ROW($A$2:$A$1840))-ROW($A$1), ROWS($M$3:M107))), \"\")","v":""},{"$f":"IFERROR(INDEX($G$2:$G$1840,_xlfn.AGGREGATE(15,3,(($A$2:$A$1840=$N$3)/($A$2:$A$1840=$N$3)*ROW($A$2:$A$1840))-ROW($A$1), ROWS($M$3:M107))), \"\")","v":""},""]
["0030","Beverly High","00300505",null,"09 - 12","NT",1274,null,"HS",348,547.20000000000005,null,null,null,{"$f":"IFERROR((RANK(T108,$T$3:$T$191,0)+COUNTIF($T$3:T108, T108)-1), \"\")","v":""},{"$f":"IFERROR(INDEX($C$2:$C$1840,_xlfn.AGGREGATE(15,3,(($A$2:$A$1840=$N$3)/($A$2:$A$1840=$N$3)*ROW($A$2:$A$1840))-ROW($A$1), ROWS($M$3:M108))), \"\")","v":""},{"$f":"IFERROR(INDEX($B$2:$B$1840,_xlfn.AGGREGATE(15,3,(($A$2:$A$1840=$N$3)/($A$2:$A$1840=$N$3)*ROW($A$2:$A$1840))-ROW($A$1), ROWS($M$3:M108))), \"\")","v":""},{"$f":"IFERROR(INDEX($J$2:$J$1840,_xlfn.AGGREGATE(15,3,(($A$2:$A$1840=$N$3)/($A$2:$A$1840=$N$3)*ROW($A$2:$A$1840))-ROW($A$1), ROWS($M$3:M108))), \"\")","v":""},{"$f":"IFERROR(INDEX($G$2:$G$1840,_xlfn.AGGREGATE(15,3,(($A$2:$A$1840=$N$3)/($A$2:$A$1840=$N$3)*ROW($A$2:$A$1840))-ROW($A$1), ROWS($M$3:M108))), \"\")","v":""},""]
["0031","Thomas Ditson","00310005",null,"K - 04","TA",535,null,"ES",126,201.60000000000002,null,null,null,{"$f":"IFERROR((RANK(T109,$T$3:$T$191,0)+COUNTIF($T$3:T109, T109)-1), \"\")","v":""},{"$f":"IFERROR(INDEX($C$2:$C$1840,_xlfn.AGGREGATE(15,3,(($A$2:$A$1840=$N$3)/($A$2:$A$1840=$N$3)*ROW($A$2:$A$1840))-ROW($A$1), ROWS($M$3:M109))), \"\")","v":""},{"$f":"IFERROR(INDEX($B$2:$B$1840,_xlfn.AGGREGATE(15,3,(($A$2:$A$1840=$N$3)/($A$2:$A$1840=$N$3)*ROW($A$2:$A$1840))-ROW($A$1), ROWS($M$3:M109))), \"\")","v":""},{"$f":"IFERROR(INDEX($J$2:$J$1840,_xlfn.AGGREGATE(15,3,(($A$2:$A$1840=$N$3)/($A$2:$A$1840=$N$3)*ROW($A$2:$A$1840))-ROW($A$1), ROWS($M$3:M109))), \"\")","v":""},{"$f":"IFERROR(INDEX($G$2:$G$1840,_xlfn.AGGREGATE(15,3,(($A$2:$A$1840=$N$3)/($A$2:$A$1840=$N$3)*ROW($A$2:$A$1840))-ROW($A$1), ROWS($M$3:M109))), \"\")","v":""},""]
["0031","Frederick J Dutile","00310007",null,"K - 04","NT",243,null,"ES",49,78.400000000000006,null,null,null,{"$f":"IFERROR((RANK(T110,$T$3:$T$191,0)+COUNTIF($T$3:T110, T110)-1), \"\")","v":""},{"$f":"IFERROR(INDEX($C$2:$C$1840,_xlfn.AGGREGATE(15,3,(($A$2:$A$1840=$N$3)/($A$2:$A$1840=$N$3)*ROW($A$2:$A$1840))-ROW($A$1), ROWS($M$3:M110))), \"\")","v":""},{"$f":"IFERROR(INDEX($B$2:$B$1840,_xlfn.AGGREGATE(15,3,(($A$2:$A$1840=$N$3)/($A$2:$A$1840=$N$3)*ROW($A$2:$A$1840))-ROW($A$1), ROWS($M$3:M110))), \"\")","v":""},{"$f":"IFERROR(INDEX($J$2:$J$1840,_xlfn.AGGREGATE(15,3,(($A$2:$A$1840=$N$3)/($A$2:$A$1840=$N$3)*ROW($A$2:$A$1840))-ROW($A$1), ROWS($M$3:M110))), \"\")","v":""},{"$f":"IFERROR(INDEX($G$2:$G$1840,_xlfn.AGGREGATE(15,3,(($A$2:$A$1840=$N$3)/($A$2:$A$1840=$N$3)*ROW($A$2:$A$1840))-ROW($A$1), ROWS($M$3:M110))), \"\")","v":""},""]
["0031","John F Kennedy","00310012",null,"K - 04","NT",303,null,"ES",59,94.4,null,null,null,{"$f":"IFERROR((RANK(T111,$T$3:$T$191,0)+COUNTIF($T$3:T111, T111)-1), \"\")","v":""},{"$f":"IFERROR(INDEX($C$2:$C$1840,_xlfn.AGGREGATE(15,3,(($A$2:$A$1840=$N$3)/($A$2:$A$1840=$N$3)*ROW($A$2:$A$1840))-ROW($A$1), ROWS($M$3:M111))), \"\")","v":""},{"$f":"IFERROR(INDEX($B$2:$B$1840,_xlfn.AGGREGATE(15,3,(($A$2:$A$1840=$N$3)/($A$2:$A$1840=$N$3)*ROW($A$2:$A$1840))-ROW($A$1), ROWS($M$3:M111))), \"\")","v":""},{"$f":"IFERROR(INDEX($J$2:$J$1840,_xlfn.AGGREGATE(15,3,(($A$2:$A$1840=$N$3)/($A$2:$A$1840=$N$3)*ROW($A$2:$A$1840))-ROW($A$1), ROWS($M$3:M111))), \"\")","v":""},{"$f":"IFERROR(INDEX($G$2:$G$1840,_xlfn.AGGREGATE(15,3,(($A$2:$A$1840=$N$3)/($A$2:$A$1840=$N$3)*ROW($A$2:$A$1840))-ROW($A$1), ROWS($M$3:M111))), \"\")","v":""},""]
["0031","Parker","00310015",null,"K - 04","TA",377,null,"ES",87,139.20000000000002,null,null,null,{"$f":"IFERROR((RANK(T112,$T$3:$T$191,0)+COUNTIF($T$3:T112, T112)-1), \"\")","v":""},{"$f":"IFERROR(INDEX($C$2:$C$1840,_xlfn.AGGREGATE(15,3,(($A$2:$A$1840=$N$3)/($A$2:$A$1840=$N$3)*ROW($A$2:$A$1840))-ROW($A$1), ROWS($M$3:M112))), \"\")","v":""},{"$f":"IFERROR(INDEX($B$2:$B$1840,_xlfn.AGGREGATE(15,3,(($A$2:$A$1840=$N$3)/($A$2:$A$1840=$N$3)*ROW($A$2:$A$1840))-ROW($A$1), ROWS($M$3:M112))), \"\")","v":""},{"$f":"IFERROR(INDEX($J$2:$J$1840,_xlfn.AGGREGATE(15,3,(($A$2:$A$1840=$N$3)/($A$2:$A$1840=$N$3)*ROW($A$2:$A$1840))-ROW($A$1), ROWS($M$3:M112))), \"\")","v":""},{"$f":"IFERROR(INDEX($G$2:$G$1840,_xlfn.AGGREGATE(15,3,(($A$2:$A$1840=$N$3)/($A$2:$A$1840=$N$3)*ROW($A$2:$A$1840))-ROW($A$1), ROWS($M$3:M112))), \"\")","v":""},""]
["0031","Hajjar Elementary","00310026",null,"K - 04","TA",355,null,"ES",111,177.60000000000002,null,null,null,{"$f":"IFERROR((RANK(T113,$T$3:$T$191,0)+COUNTIF($T$3:T113, T113)-1), \"\")","v":""},{"$f":"IFERROR(INDEX($C$2:$C$1840,_xlfn.AGGREGATE(15,3,(($A$2:$A$1840=$N$3)/($A$2:$A$1840=$N$3)*ROW($A$2:$A$1840))-ROW($A$1), ROWS($M$3:M113))), \"\")","v":""},{"$f":"IFERROR(INDEX($B$2:$B$1840,_xlfn.AGGREGATE(15,3,(($A$2:$A$1840=$N$3)/($A$2:$A$1840=$N$3)*ROW($A$2:$A$1840))-ROW($A$1), ROWS($M$3:M113))), \"\")","v":""},{"$f":"IFERROR(INDEX($J$2:$J$1840,_xlfn.AGGREGATE(15,3,(($A$2:$A$1840=$N$3)/($A$2:$A$1840=$N$3)*ROW($A$2:$A$1840))-ROW($A$1), ROWS($M$3:M113))), \"\")","v":""},{"$f":"IFERROR(INDEX($G$2:$G$1840,_xlfn.AGGREGATE(15,3,(($A$2:$A$1840=$N$3)/($A$2:$A$1840=$N$3)*ROW($A$2:$A$1840))-ROW($A$1), ROWS($M$3:M113))), \"\")","v":""},""]
["0031","Marshall Middle School","00310305",null,"05 - 07","TA",595,null,"MS",156,249.60000000000002,null,null,null,{"$f":"IFERROR((RANK(T114,$T$3:$T$191,0)+COUNTIF($T$3:T114, T114)-1), \"\")","v":""},{"$f":"IFERROR(INDEX($C$2:$C$1840,_xlfn.AGGREGATE(15,3,(($A$2:$A$1840=$N$3)/($A$2:$A$1840=$N$3)*ROW($A$2:$A$1840))-ROW($A$1), ROWS($M$3:M114))), \"\")","v":""},{"$f":"IFERROR(INDEX($B$2:$B$1840,_xlfn.AGGREGATE(15,3,(($A$2:$A$1840=$N$3)/($A$2:$A$1840=$N$3)*ROW($A$2:$A$1840))-ROW($A$1), ROWS($M$3:M114))), \"\")","v":""},{"$f":"IFERROR(INDEX($J$2:$J$1840,_xlfn.AGGREGATE(15,3,(($A$2:$A$1840=$N$3)/($A$2:$A$1840=$N$3)*ROW($A$2:$A$1840))-ROW($A$1), ROWS($M$3:M114))), \"\")","v":""},{"$f":"IFERROR(INDEX($G$2:$G$1840,_xlfn.AGGREGATE(15,3,(($A$2:$A$1840=$N$3)/($A$2:$A$1840=$N$3)*ROW($A$2:$A$1840))-ROW($A$1), ROWS($M$3:M114))), \"\")","v":""},""]
["0031","Locke Middle","00310310",null,"05 - 07","NT",546,null,"MS",89,142.4,null,null,null,{"$f":"IFERROR((RANK(T115,$T$3:$T$191,0)+COUNTIF($T$3:T115, T115)-1), \"\")","v":""},{"$f":"IFERROR(INDEX($C$2:$C$1840,_xlfn.AGGREGATE(15,3,(($A$2:$A$1840=$N$3)/($A$2:$A$1840=$N$3)*ROW($A$2:$A$1840))-ROW($A$1), ROWS($M$3:M115))), \"\")","v":""},{"$f":"IFERROR(INDEX($B$2:$B$1840,_xlfn.AGGREGATE(15,3,(($A$2:$A$1840=$N$3)/($A$2:$A$1840=$N$3)*ROW($A$2:$A$1840))-ROW($A$1), ROWS($M$3:M115))), \"\")","v":""},{"$f":"IFERROR(INDEX($J$2:$J$1840,_xlfn.AGGREGATE(15,3,(($A$2:$A$1840=$N$3)/($A$2:$A$1840=$N$3)*ROW($A$2:$A$1840))-ROW($A$1), ROWS($M$3:M115))), \"\")","v":""},{"$f":"IFERROR(INDEX($G$2:$G$1840,_xlfn.AGGREGATE(15,3,(($A$2:$A$1840=$N$3)/($A$2:$A$1840=$N$3)*ROW($A$2:$A$1840))-ROW($A$1), ROWS($M$3:M115))), \"\")","v":""},""]
["0031","Billerica Memorial High School","00310505",null,"PK,08 -12","NT",1617,null,"MSHS/K-12",311,432,null,null,null,{"$f":"IFERROR((RANK(T116,$T$3:$T$191,0)+COUNTIF($T$3:T116, T116)-1), \"\")","v":""},{"$f":"IFERROR(INDEX($C$2:$C$1840,_xlfn.AGGREGATE(15,3,(($A$2:$A$1840=$N$3)/($A$2:$A$1840=$N$3)*ROW($A$2:$A$1840))-ROW($A$1), ROWS($M$3:M116))), \"\")","v":""},{"$f":"IFERROR(INDEX($B$2:$B$1840,_xlfn.AGGREGATE(15,3,(($A$2:$A$1840=$N$3)/($A$2:$A$1840=$N$3)*ROW($A$2:$A$1840))-ROW($A$1), ROWS($M$3:M116))), \"\")","v":""},{"$f":"IFERROR(INDEX($J$2:$J$1840,_xlfn.AGGREGATE(15,3,(($A$2:$A$1840=$N$3)/($A$2:$A$1840=$N$3)*ROW($A$2:$A$1840))-ROW($A$1), ROWS($M$3:M116))), \"\")","v":""},{"$f":"IFERROR(INDEX($G$2:$G$1840,_xlfn.AGGREGATE(15,3,(($A$2:$A$1840=$N$3)/($A$2:$A$1840=$N$3)*ROW($A$2:$A$1840))-ROW($A$1), ROWS($M$3:M116))), \"\")","v":""},""]
["0035","Lee Academy","00350001",null,"PK - 03","SW",199,null,"ES",153,182.4,null,null,null,{"$f":"IFERROR((RANK(T117,$T$3:$T$191,0)+COUNTIF($T$3:T117, T117)-1), \"\")","v":""},{"$f":"IFERROR(INDEX($C$2:$C$1840,_xlfn.AGGREGATE(15,3,(($A$2:$A$1840=$N$3)/($A$2:$A$1840=$N$3)*ROW($A$2:$A$1840))-ROW($A$1), ROWS($M$3:M117))), \"\")","v":""},{"$f":"IFERROR(INDEX($B$2:$B$1840,_xlfn.AGGREGATE(15,3,(($A$2:$A$1840=$N$3)/($A$2:$A$1840=$N$3)*ROW($A$2:$A$1840))-ROW($A$1), ROWS($M$3:M117))), \"\")","v":""},{"$f":"IFERROR(INDEX($J$2:$J$1840,_xlfn.AGGREGATE(15,3,(($A$2:$A$1840=$N$3)/($A$2:$A$1840=$N$3)*ROW($A$2:$A$1840))-ROW($A$1), ROWS($M$3:M117))), \"\")","v":""},{"$f":"IFERROR(INDEX($G$2:$G$1840,_xlfn.AGGREGATE(15,3,(($A$2:$A$1840=$N$3)/($A$2:$A$1840=$N$3)*ROW($A$2:$A$1840))-ROW($A$1), ROWS($M$3:M117))), \"\")","v":""},""]
["0035","Baldwin Early Learning Center","00350003",null,"PK - 01","SW",147,null,"EES",70,64,null,null,null,{"$f":"IFERROR((RANK(T118,$T$3:$T$191,0)+COUNTIF($T$3:T118, T118)-1), \"\")","v":""},{"$f":"IFERROR(INDEX($C$2:$C$1840,_xlfn.AGGREGATE(15,3,(($A$2:$A$1840=$N$3)/($A$2:$A$1840=$N$3)*ROW($A$2:$A$1840))-ROW($A$1), ROWS($M$3:M118))), \"\")","v":""},{"$f":"IFERROR(INDEX($B$2:$B$1840,_xlfn.AGGREGATE(15,3,(($A$2:$A$1840=$N$3)/($A$2:$A$1840=$N$3)*ROW($A$2:$A$1840))-ROW($A$1), ROWS($M$3:M118))), \"\")","v":""},{"$f":"IFERROR(INDEX($J$2:$J$1840,_xlfn.AGGREGATE(15,3,(($A$2:$A$1840=$N$3)/($A$2:$A$1840=$N$3)*ROW($A$2:$A$1840))-ROW($A$1), ROWS($M$3:M118))), \"\")","v":""},{"$f":"IFERROR(INDEX($G$2:$G$1840,_xlfn.AGGREGATE(15,3,(($A$2:$A$1840=$N$3)/($A$2:$A$1840=$N$3)*ROW($A$2:$A$1840))-ROW($A$1), ROWS($M$3:M118))), \"\")","v":""},""]
["0035","Lyon K-8","00350004",null,"K - 08","SW",124,null,"ESMS",74,118.4,null,null,null,{"$f":"IFERROR((RANK(T119,$T$3:$T$191,0)+COUNTIF($T$3:T119, T119)-1), \"\")","v":""},{"$f":"IFERROR(INDEX($C$2:$C$1840,_xlfn.AGGREGATE(15,3,(($A$2:$A$1840=$N$3)/($A$2:$A$1840=$N$3)*ROW($A$2:$A$1840))-ROW($A$1), ROWS($M$3:M119))), \"\")","v":""},{"$f":"IFERROR(INDEX($B$2:$B$1840,_xlfn.AGGREGATE(15,3,(($A$2:$A$1840=$N$3)/($A$2:$A$1840=$N$3)*ROW($A$2:$A$1840))-ROW($A$1), ROWS($M$3:M119))), \"\")","v":""},{"$f":"IFERROR(INDEX($J$2:$J$1840,_xlfn.AGGREGATE(15,3,(($A$2:$A$1840=$N$3)/($A$2:$A$1840=$N$3)*ROW($A$2:$A$1840))-ROW($A$1), ROWS($M$3:M119))), \"\")","v":""},{"$f":"IFERROR(INDEX($G$2:$G$1840,_xlfn.AGGREGATE(15,3,(($A$2:$A$1840=$N$3)/($A$2:$A$1840=$N$3)*ROW($A$2:$A$1840))-ROW($A$1), ROWS($M$3:M119))), \"\")","v":""},""]
["0035","ELC: West Zone","00350006",null,"PK - 01","SW",93,null,"EES",65,64,null,null,null,{"$f":"IFERROR((RANK(T120,$T$3:$T$191,0)+COUNTIF($T$3:T120, T120)-1), \"\")","v":""},{"$f":"IFERROR(INDEX($C$2:$C$1840,_xlfn.AGGREGATE(15,3,(($A$2:$A$1840=$N$3)/($A$2:$A$1840=$N$3)*ROW($A$2:$A$1840))-ROW($A$1), ROWS($M$3:M120))), \"\")","v":""},{"$f":"IFERROR(INDEX($B$2:$B$1840,_xlfn.AGGREGATE(15,3,(($A$2:$A$1840=$N$3)/($A$2:$A$1840=$N$3)*ROW($A$2:$A$1840))-ROW($A$1), ROWS($M$3:M120))), \"\")","v":""},{"$f":"IFERROR(INDEX($J$2:$J$1840,_xlfn.AGGREGATE(15,3,(($A$2:$A$1840=$N$3)/($A$2:$A$1840=$N$3)*ROW($A$2:$A$1840))-ROW($A$1), ROWS($M$3:M120))), \"\")","v":""},{"$f":"IFERROR(INDEX($G$2:$G$1840,_xlfn.AGGREGATE(15,3,(($A$2:$A$1840=$N$3)/($A$2:$A$1840=$N$3)*ROW($A$2:$A$1840))-ROW($A$1), ROWS($M$3:M120))), \"\")","v":""},""]
["0035","Dr. Catherine Ellison-Rosa Parks Early Ed School","00350008",null,"PK - 03","SW",178,null,"ES",126,152,null,null,null,{"$f":"IFERROR((RANK(T121,$T$3:$T$191,0)+COUNTIF($T$3:T121, T121)-1), \"\")","v":""},{"$f":"IFERROR(INDEX($C$2:$C$1840,_xlfn.AGGREGATE(15,3,(($A$2:$A$1840=$N$3)/($A$2:$A$1840=$N$3)*ROW($A$2:$A$1840))-ROW($A$1), ROWS($M$3:M121))), \"\")","v":""},{"$f":"IFERROR(INDEX($B$2:$B$1840,_xlfn.AGGREGATE(15,3,(($A$2:$A$1840=$N$3)/($A$2:$A$1840=$N$3)*ROW($A$2:$A$1840))-ROW($A$1), ROWS($M$3:M121))), \"\")","v":""},{"$f":"IFERROR(INDEX($J$2:$J$1840,_xlfn.AGGREGATE(15,3,(($A$2:$A$1840=$N$3)/($A$2:$A$1840=$N$3)*ROW($A$2:$A$1840))-ROW($A$1), ROWS($M$3:M121))), \"\")","v":""},{"$f":"IFERROR(INDEX($G$2:$G$1840,_xlfn.AGGREGATE(15,3,(($A$2:$A$1840=$N$3)/($A$2:$A$1840=$N$3)*ROW($A$2:$A$1840))-ROW($A$1), ROWS($M$3:M121))), \"\")","v":""},""]
["0035","East Boston Early Childhood Center","00350009",null,"PK - 01","SW",189,null,"EES",108,104,null,null,null,{"$f":"IFERROR((RANK(T122,$T$3:$T$191,0)+COUNTIF($T$3:T122, T122)-1), \"\")","v":""},{"$f":"IFERROR(INDEX($C$2:$C$1840,_xlfn.AGGREGATE(15,3,(($A$2:$A$1840=$N$3)/($A$2:$A$1840=$N$3)*ROW($A$2:$A$1840))-ROW($A$1), ROWS($M$3:M122))), \"\")","v":""},{"$f":"IFERROR(INDEX($B$2:$B$1840,_xlfn.AGGREGATE(15,3,(($A$2:$A$1840=$N$3)/($A$2:$A$1840=$N$3)*ROW($A$2:$A$1840))-ROW($A$1), ROWS($M$3:M122))), \"\")","v":""},{"$f":"IFERROR(INDEX($J$2:$J$1840,_xlfn.AGGREGATE(15,3,(($A$2:$A$1840=$N$3)/($A$2:$A$1840=$N$3)*ROW($A$2:$A$1840))-ROW($A$1), ROWS($M$3:M122))), \"\")","v":""},{"$f":"IFERROR(INDEX($G$2:$G$1840,_xlfn.AGGREGATE(15,3,(($A$2:$A$1840=$N$3)/($A$2:$A$1840=$N$3)*ROW($A$2:$A$1840))-ROW($A$1), ROWS($M$3:M122))), \"\")","v":""},""]
["0035","Haynes Early Education Center","00350010",null,"PK - 01","SW",187,null,"EES",142,160,null,null,null,{"$f":"IFERROR((RANK(T123,$T$3:$T$191,0)+COUNTIF($T$3:T123, T123)-1), \"\")","v":""},{"$f":"IFERROR(INDEX($C$2:$C$1840,_xlfn.AGGREGATE(15,3,(($A$2:$A$1840=$N$3)/($A$2:$A$1840=$N$3)*ROW($A$2:$A$1840))-ROW($A$1), ROWS($M$3:M123))), \"\")","v":""},{"$f":"IFERROR(INDEX($B$2:$B$1840,_xlfn.AGGREGATE(15,3,(($A$2:$A$1840=$N$3)/($A$2:$A$1840=$N$3)*ROW($A$2:$A$1840))-ROW($A$1), ROWS($M$3:M123))), \"\")","v":""},{"$f":"IFERROR(INDEX($J$2:$J$1840,_xlfn.AGGREGATE(15,3,(($A$2:$A$1840=$N$3)/($A$2:$A$1840=$N$3)*ROW($A$2:$A$1840))-ROW($A$1), ROWS($M$3:M123))), \"\")","v":""},{"$f":"IFERROR(INDEX($G$2:$G$1840,_xlfn.AGGREGATE(15,3,(($A$2:$A$1840=$N$3)/($A$2:$A$1840=$N$3)*ROW($A$2:$A$1840))-ROW($A$1), ROWS($M$3:M123))), \"\")","v":""},""]
["0035","Boston Teachers Union School","00350012",null,"PK - 08","SW",286,null,"ESMS",115,166.4,null,null,null,{"$f":"IFERROR((RANK(T124,$T$3:$T$191,0)+COUNTIF($T$3:T124, T124)-1), \"\")","v":""},{"$f":"IFERROR(INDEX($C$2:$C$1840,_xlfn.AGGREGATE(15,3,(($A$2:$A$1840=$N$3)/($A$2:$A$1840=$N$3)*ROW($A$2:$A$1840))-ROW($A$1), ROWS($M$3:M124))), \"\")","v":""},{"$f":"IFERROR(INDEX($B$2:$B$1840,_xlfn.AGGREGATE(15,3,(($A$2:$A$1840=$N$3)/($A$2:$A$1840=$N$3)*ROW($A$2:$A$1840))-ROW($A$1), ROWS($M$3:M124))), \"\")","v":""},{"$f":"IFERROR(INDEX($J$2:$J$1840,_xlfn.AGGREGATE(15,3,(($A$2:$A$1840=$N$3)/($A$2:$A$1840=$N$3)*ROW($A$2:$A$1840))-ROW($A$1), ROWS($M$3:M124))), \"\")","v":""},{"$f":"IFERROR(INDEX($G$2:$G$1840,_xlfn.AGGREGATE(15,3,(($A$2:$A$1840=$N$3)/($A$2:$A$1840=$N$3)*ROW($A$2:$A$1840))-ROW($A$1), ROWS($M$3:M124))), \"\")","v":""},""]
["0035","Jackson Mann","00350013",null,"PK - 08","SW",431,null,"ESMS",355,534.4,null,null,null,{"$f":"IFERROR((RANK(T125,$T$3:$T$191,0)+COUNTIF($T$3:T125, T125)-1), \"\")","v":""},{"$f":"IFERROR(INDEX($C$2:$C$1840,_xlfn.AGGREGATE(15,3,(($A$2:$A$1840=$N$3)/($A$2:$A$1840=$N$3)*ROW($A$2:$A$1840))-ROW($A$1), ROWS($M$3:M125))), \"\")","v":""},{"$f":"IFERROR(INDEX($B$2:$B$1840,_xlfn.AGGREGATE(15,3,(($A$2:$A$1840=$N$3)/($A$2:$A$1840=$N$3)*ROW($A$2:$A$1840))-ROW($A$1), ROWS($M$3:M125))), \"\")","v":""},{"$f":"IFERROR(INDEX($J$2:$J$1840,_xlfn.AGGREGATE(15,3,(($A$2:$A$1840=$N$3)/($A$2:$A$1840=$N$3)*ROW($A$2:$A$1840))-ROW($A$1), ROWS($M$3:M125))), \"\")","v":""},{"$f":"IFERROR(INDEX($G$2:$G$1840,_xlfn.AGGREGATE(15,3,(($A$2:$A$1840=$N$3)/($A$2:$A$1840=$N$3)*ROW($A$2:$A$1840))-ROW($A$1), ROWS($M$3:M125))), \"\")","v":""},""]
["0035","Pauline Agassiz Shaw Elementary School","00350014",null,"PK - 03","SW",163,null,"ES",135,176,null,null,null,{"$f":"IFERROR((RANK(T126,$T$3:$T$191,0)+COUNTIF($T$3:T126, T126)-1), \"\")","v":""},{"$f":"IFERROR(INDEX($C$2:$C$1840,_xlfn.AGGREGATE(15,3,(($A$2:$A$1840=$N$3)/($A$2:$A$1840=$N$3)*ROW($A$2:$A$1840))-ROW($A$1), ROWS($M$3:M126))), \"\")","v":""},{"$f":"IFERROR(INDEX($B$2:$B$1840,_xlfn.AGGREGATE(15,3,(($A$2:$A$1840=$N$3)/($A$2:$A$1840=$N$3)*ROW($A$2:$A$1840))-ROW($A$1), ROWS($M$3:M126))), \"\")","v":""},{"$f":"IFERROR(INDEX($J$2:$J$1840,_xlfn.AGGREGATE(15,3,(($A$2:$A$1840=$N$3)/($A$2:$A$1840=$N$3)*ROW($A$2:$A$1840))-ROW($A$1), ROWS($M$3:M126))), \"\")","v":""},{"$f":"IFERROR(INDEX($G$2:$G$1840,_xlfn.AGGREGATE(15,3,(($A$2:$A$1840=$N$3)/($A$2:$A$1840=$N$3)*ROW($A$2:$A$1840))-ROW($A$1), ROWS($M$3:M126))), \"\")","v":""},""]
["0035","Higginson","00350015",null,"PK - 02","SW",131,null,"EES",112,144,null,null,null,{"$f":"IFERROR((RANK(T127,$T$3:$T$191,0)+COUNTIF($T$3:T127, T127)-1), \"\")","v":""},{"$f":"IFERROR(INDEX($C$2:$C$1840,_xlfn.AGGREGATE(15,3,(($A$2:$A$1840=$N$3)/($A$2:$A$1840=$N$3)*ROW($A$2:$A$1840))-ROW($A$1), ROWS($M$3:M127))), \"\")","v":""},{"$f":"IFERROR(INDEX($B$2:$B$1840,_xlfn.AGGREGATE(15,3,(($A$2:$A$1840=$N$3)/($A$2:$A$1840=$N$3)*ROW($A$2:$A$1840))-ROW($A$1), ROWS($M$3:M127))), \"\")","v":""},{"$f":"IFERROR(INDEX($J$2:$J$1840,_xlfn.AGGREGATE(15,3,(($A$2:$A$1840=$N$3)/($A$2:$A$1840=$N$3)*ROW($A$2:$A$1840))-ROW($A$1), ROWS($M$3:M127))), \"\")","v":""},{"$f":"IFERROR(INDEX($G$2:$G$1840,_xlfn.AGGREGATE(15,3,(($A$2:$A$1840=$N$3)/($A$2:$A$1840=$N$3)*ROW($A$2:$A$1840))-ROW($A$1), ROWS($M$3:M127))), \"\")","v":""},""]
["0035","Mattahunt Elementary School","00350016",null,"PK - 04","SW",416,null,"ES",309,388.8,null,null,null,{"$f":"IFERROR((RANK(T128,$T$3:$T$191,0)+COUNTIF($T$3:T128, T128)-1), \"\")","v":""},{"$f":"IFERROR(INDEX($C$2:$C$1840,_xlfn.AGGREGATE(15,3,(($A$2:$A$1840=$N$3)/($A$2:$A$1840=$N$3)*ROW($A$2:$A$1840))-ROW($A$1), ROWS($M$3:M128))), \"\")","v":""},{"$f":"IFERROR(INDEX($B$2:$B$1840,_xlfn.AGGREGATE(15,3,(($A$2:$A$1840=$N$3)/($A$2:$A$1840=$N$3)*ROW($A$2:$A$1840))-ROW($A$1), ROWS($M$3:M128))), \"\")","v":""},{"$f":"IFERROR(INDEX($J$2:$J$1840,_xlfn.AGGREGATE(15,3,(($A$2:$A$1840=$N$3)/($A$2:$A$1840=$N$3)*ROW($A$2:$A$1840))-ROW($A$1), ROWS($M$3:M128))), \"\")","v":""},{"$f":"IFERROR(INDEX($G$2:$G$1840,_xlfn.AGGREGATE(15,3,(($A$2:$A$1840=$N$3)/($A$2:$A$1840=$N$3)*ROW($A$2:$A$1840))-ROW($A$1), ROWS($M$3:M128))), \"\")","v":""},""]
["0035","Curley K-8 School","00350020",null,"PK - 08","SW",914,null,"ESMS",458,683.2,null,null,null,{"$f":"IFERROR((RANK(T129,$T$3:$T$191,0)+COUNTIF($T$3:T129, T129)-1), \"\")","v":""},{"$f":"IFERROR(INDEX($C$2:$C$1840,_xlfn.AGGREGATE(15,3,(($A$2:$A$1840=$N$3)/($A$2:$A$1840=$N$3)*ROW($A$2:$A$1840))-ROW($A$1), ROWS($M$3:M129))), \"\")","v":""},{"$f":"IFERROR(INDEX($B$2:$B$1840,_xlfn.AGGREGATE(15,3,(($A$2:$A$1840=$N$3)/($A$2:$A$1840=$N$3)*ROW($A$2:$A$1840))-ROW($A$1), ROWS($M$3:M129))), \"\")","v":""},{"$f":"IFERROR(INDEX($J$2:$J$1840,_xlfn.AGGREGATE(15,3,(($A$2:$A$1840=$N$3)/($A$2:$A$1840=$N$3)*ROW($A$2:$A$1840))-ROW($A$1), ROWS($M$3:M129))), \"\")","v":""},{"$f":"IFERROR(INDEX($G$2:$G$1840,_xlfn.AGGREGATE(15,3,(($A$2:$A$1840=$N$3)/($A$2:$A$1840=$N$3)*ROW($A$2:$A$1840))-ROW($A$1), ROWS($M$3:M129))), \"\")","v":""},""]
["0035","Beethoven","00350021",null,"PK - 02","SW",277,null,"EES",125,184,null,null,null,{"$f":"IFERROR((RANK(T130,$T$3:$T$191,0)+COUNTIF($T$3:T130, T130)-1), \"\")","v":""},{"$f":"IFERROR(INDEX($C$2:$C$1840,_xlfn.AGGREGATE(15,3,(($A$2:$A$1840=$N$3)/($A$2:$A$1840=$N$3)*ROW($A$2:$A$1840))-ROW($A$1), ROWS($M$3:M130))), \"\")","v":""},{"$f":"IFERROR(INDEX($B$2:$B$1840,_xlfn.AGGREGATE(15,3,(($A$2:$A$1840=$N$3)/($A$2:$A$1840=$N$3)*ROW($A$2:$A$1840))-ROW($A$1), ROWS($M$3:M130))), \"\")","v":""},{"$f":"IFERROR(INDEX($J$2:$J$1840,_xlfn.AGGREGATE(15,3,(($A$2:$A$1840=$N$3)/($A$2:$A$1840=$N$3)*ROW($A$2:$A$1840))-ROW($A$1), ROWS($M$3:M130))), \"\")","v":""},{"$f":"IFERROR(INDEX($G$2:$G$1840,_xlfn.AGGREGATE(15,3,(($A$2:$A$1840=$N$3)/($A$2:$A$1840=$N$3)*ROW($A$2:$A$1840))-ROW($A$1), ROWS($M$3:M130))), \"\")","v":""},""]
["0035","Carter School","00350036",null,"07 - 12","SW",27,null,"MSHS/K-12",22,19.200000000000003,null,null,null,{"$f":"IFERROR((RANK(T131,$T$3:$T$191,0)+COUNTIF($T$3:T131, T131)-1), \"\")","v":""},{"$f":"IFERROR(INDEX($C$2:$C$1840,_xlfn.AGGREGATE(15,3,(($A$2:$A$1840=$N$3)/($A$2:$A$1840=$N$3)*ROW($A$2:$A$1840))-ROW($A$1), ROWS($M$3:M131))), \"\")","v":""},{"$f":"IFERROR(INDEX($B$2:$B$1840,_xlfn.AGGREGATE(15,3,(($A$2:$A$1840=$N$3)/($A$2:$A$1840=$N$3)*ROW($A$2:$A$1840))-ROW($A$1), ROWS($M$3:M131))), \"\")","v":""},{"$f":"IFERROR(INDEX($J$2:$J$1840,_xlfn.AGGREGATE(15,3,(($A$2:$A$1840=$N$3)/($A$2:$A$1840=$N$3)*ROW($A$2:$A$1840))-ROW($A$1), ROWS($M$3:M131))), \"\")","v":""},{"$f":"IFERROR(INDEX($G$2:$G$1840,_xlfn.AGGREGATE(15,3,(($A$2:$A$1840=$N$3)/($A$2:$A$1840=$N$3)*ROW($A$2:$A$1840))-ROW($A$1), ROWS($M$3:M131))), \"\")","v":""},{"$f":"IFERROR(R131/S131, \"\")","v":""}]
["0035","Charles Sumner","00350052",null,"PK - 05","SW",492,null,"ES",298,428.8,null,null,null,{"$f":"IFERROR((RANK(T132,$T$3:$T$191,0)+COUNTIF($T$3:T132, T132)-1), \"\")","v":""},{"$f":"IFERROR(INDEX($C$2:$C$1840,_xlfn.AGGREGATE(15,3,(($A$2:$A$1840=$N$3)/($A$2:$A$1840=$N$3)*ROW($A$2:$A$1840))-ROW($A$1), ROWS($M$3:M132))), \"\")","v":""},{"$f":"IFERROR(INDEX($B$2:$B$1840,_xlfn.AGGREGATE(15,3,(($A$2:$A$1840=$N$3)/($A$2:$A$1840=$N$3)*ROW($A$2:$A$1840))-ROW($A$1), ROWS($M$3:M132))), \"\")","v":""},{"$f":"IFERROR(INDEX($J$2:$J$1840,_xlfn.AGGREGATE(15,3,(($A$2:$A$1840=$N$3)/($A$2:$A$1840=$N$3)*ROW($A$2:$A$1840))-ROW($A$1), ROWS($M$3:M132))), \"\")","v":""},{"$f":"IFERROR(INDEX($G$2:$G$1840,_xlfn.AGGREGATE(15,3,(($A$2:$A$1840=$N$3)/($A$2:$A$1840=$N$3)*ROW($A$2:$A$1840))-ROW($A$1), ROWS($M$3:M132))), \"\")","v":""},""]
["0035","Charles H Taylor","00350054",null,"PK - 05","SW",330,null,"ES",278,419.20000000000005,null,null,null,{"$f":"IFERROR((RANK(T133,$T$3:$T$191,0)+COUNTIF($T$3:T133, T133)-1), \"\")","v":""},{"$f":"IFERROR(INDEX($C$2:$C$1840,_xlfn.AGGREGATE(15,3,(($A$2:$A$1840=$N$3)/($A$2:$A$1840=$N$3)*ROW($A$2:$A$1840))-ROW($A$1), ROWS($M$3:M133))), \"\")","v":""},{"$f":"IFERROR(INDEX($B$2:$B$1840,_xlfn.AGGREGATE(15,3,(($A$2:$A$1840=$N$3)/($A$2:$A$1840=$N$3)*ROW($A$2:$A$1840))-ROW($A$1), ROWS($M$3:M133))), \"\")","v":""},{"$f":"IFERROR(INDEX($J$2:$J$1840,_xlfn.AGGREGATE(15,3,(($A$2:$A$1840=$N$3)/($A$2:$A$1840=$N$3)*ROW($A$2:$A$1840))-ROW($A$1), ROWS($M$3:M133))), \"\")","v":""},{"$f":"IFERROR(INDEX($G$2:$G$1840,_xlfn.AGGREGATE(15,3,(($A$2:$A$1840=$N$3)/($A$2:$A$1840=$N$3)*ROW($A$2:$A$1840))-ROW($A$1), ROWS($M$3:M133))), \"\")","v":""},""]
["0035","Curtis Guild","00350062",null,"PK - 06","SW",267,null,"ES",175,251.20000000000002,null,null,null,{"$f":"IFERROR((RANK(T134,$T$3:$T$191,0)+COUNTIF($T$3:T134, T134)-1), \"\")","v":""},{"$f":"IFERROR(INDEX($C$2:$C$1840,_xlfn.AGGREGATE(15,3,(($A$2:$A$1840=$N$3)/($A$2:$A$1840=$N$3)*ROW($A$2:$A$1840))-ROW($A$1), ROWS($M$3:M134))), \"\")","v":""},{"$f":"IFERROR(INDEX($B$2:$B$1840,_xlfn.AGGREGATE(15,3,(($A$2:$A$1840=$N$3)/($A$2:$A$1840=$N$3)*ROW($A$2:$A$1840))-ROW($A$1), ROWS($M$3:M134))), \"\")","v":""},{"$f":"IFERROR(INDEX($J$2:$J$1840,_xlfn.AGGREGATE(15,3,(($A$2:$A$1840=$N$3)/($A$2:$A$1840=$N$3)*ROW($A$2:$A$1840))-ROW($A$1), ROWS($M$3:M134))), \"\")","v":""},{"$f":"IFERROR(INDEX($G$2:$G$1840,_xlfn.AGGREGATE(15,3,(($A$2:$A$1840=$N$3)/($A$2:$A$1840=$N$3)*ROW($A$2:$A$1840))-ROW($A$1), ROWS($M$3:M134))), \"\")","v":""},""]
["0035","Dante Alighieri Montessori School","00350066",null,"PK - 06","SW",113,null,"ES",45,56,null,null,null,{"$f":"IFERROR((RANK(T135,$T$3:$T$191,0)+COUNTIF($T$3:T135, T135)-1), \"\")","v":""},{"$f":"IFERROR(INDEX($C$2:$C$1840,_xlfn.AGGREGATE(15,3,(($A$2:$A$1840=$N$3)/($A$2:$A$1840=$N$3)*ROW($A$2:$A$1840))-ROW($A$1), ROWS($M$3:M135))), \"\")","v":""},{"$f":"IFERROR(INDEX($B$2:$B$1840,_xlfn.AGGREGATE(15,3,(($A$2:$A$1840=$N$3)/($A$2:$A$1840=$N$3)*ROW($A$2:$A$1840))-ROW($A$1), ROWS($M$3:M135))), \"\")","v":""},{"$f":"IFERROR(INDEX($J$2:$J$1840,_xlfn.AGGREGATE(15,3,(($A$2:$A$1840=$N$3)/($A$2:$A$1840=$N$3)*ROW($A$2:$A$1840))-ROW($A$1), ROWS($M$3:M135))), \"\")","v":""},{"$f":"IFERROR(INDEX($G$2:$G$1840,_xlfn.AGGREGATE(15,3,(($A$2:$A$1840=$N$3)/($A$2:$A$1840=$N$3)*ROW($A$2:$A$1840))-ROW($A$1), ROWS($M$3:M135))), \"\")","v":""},""]
["0035","David A Ellis","00350072",null,"PK - 05","SW",358,null,"ES",317,451.20000000000005,null,null,null,{"$f":"IFERROR((RANK(T136,$T$3:$T$191,0)+COUNTIF($T$3:T136, T136)-1), \"\")","v":""},{"$f":"IFERROR(INDEX($C$2:$C$1840,_xlfn.AGGREGATE(15,3,(($A$2:$A$1840=$N$3)/($A$2:$A$1840=$N$3)*ROW($A$2:$A$1840))-ROW($A$1), ROWS($M$3:M136))), \"\")","v":""},{"$f":"IFERROR(INDEX($B$2:$B$1840,_xlfn.AGGREGATE(15,3,(($A$2:$A$1840=$N$3)/($A$2:$A$1840=$N$3)*ROW($A$2:$A$1840))-ROW($A$1), ROWS($M$3:M136))), \"\")","v":""},{"$f":"IFERROR(INDEX($J$2:$J$1840,_xlfn.AGGREGATE(15,3,(($A$2:$A$1840=$N$3)/($A$2:$A$1840=$N$3)*ROW($A$2:$A$1840))-ROW($A$1), ROWS($M$3:M136))), \"\")","v":""},{"$f":"IFERROR(INDEX($G$2:$G$1840,_xlfn.AGGREGATE(15,3,(($A$2:$A$1840=$N$3)/($A$2:$A$1840=$N$3)*ROW($A$2:$A$1840))-ROW($A$1), ROWS($M$3:M136))), \"\")","v":""},""]
["0035","Dearborn","00350074",null,"06 - 12","SW",574,null,"MSHS/K-12",435,696,null,null,null,{"$f":"IFERROR((RANK(T137,$T$3:$T$191,0)+COUNTIF($T$3:T137, T137)-1), \"\")","v":""},{"$f":"IFERROR(INDEX($C$2:$C$1840,_xlfn.AGGREGATE(15,3,(($A$2:$A$1840=$N$3)/($A$2:$A$1840=$N$3)*ROW($A$2:$A$1840))-ROW($A$1), ROWS($M$3:M137))), \"\")","v":""},{"$f":"IFERROR(INDEX($B$2:$B$1840,_xlfn.AGGREGATE(15,3,(($A$2:$A$1840=$N$3)/($A$2:$A$1840=$N$3)*ROW($A$2:$A$1840))-ROW($A$1), ROWS($M$3:M137))), \"\")","v":""},{"$f":"IFERROR(INDEX($J$2:$J$1840,_xlfn.AGGREGATE(15,3,(($A$2:$A$1840=$N$3)/($A$2:$A$1840=$N$3)*ROW($A$2:$A$1840))-ROW($A$1), ROWS($M$3:M137))), \"\")","v":""},{"$f":"IFERROR(INDEX($G$2:$G$1840,_xlfn.AGGREGATE(15,3,(($A$2:$A$1840=$N$3)/($A$2:$A$1840=$N$3)*ROW($A$2:$A$1840))-ROW($A$1), ROWS($M$3:M137))), \"\")","v":""},""]
["0035","Dennis C Haley","00350077",null,"PK - 08","SW",397,null,"ESMS",225,339.20000000000005,null,null,null,{"$f":"IFERROR((RANK(T138,$T$3:$T$191,0)+COUNTIF($T$3:T138, T138)-1), \"\")","v":""},{"$f":"IFERROR(INDEX($C$2:$C$1840,_xlfn.AGGREGATE(15,3,(($A$2:$A$1840=$N$3)/($A$2:$A$1840=$N$3)*ROW($A$2:$A$1840))-ROW($A$1), ROWS($M$3:M138))), \"\")","v":""},{"$f":"IFERROR(INDEX($B$2:$B$1840,_xlfn.AGGREGATE(15,3,(($A$2:$A$1840=$N$3)/($A$2:$A$1840=$N$3)*ROW($A$2:$A$1840))-ROW($A$1), ROWS($M$3:M138))), \"\")","v":""},{"$f":"IFERROR(INDEX($J$2:$J$1840,_xlfn.AGGREGATE(15,3,(($A$2:$A$1840=$N$3)/($A$2:$A$1840=$N$3)*ROW($A$2:$A$1840))-ROW($A$1), ROWS($M$3:M138))), \"\")","v":""},{"$f":"IFERROR(INDEX($G$2:$G$1840,_xlfn.AGGREGATE(15,3,(($A$2:$A$1840=$N$3)/($A$2:$A$1840=$N$3)*ROW($A$2:$A$1840))-ROW($A$1), ROWS($M$3:M138))), \"\")","v":""},""]
["0035","Donald Mckay","00350080",null,"PK - 08","SW",754,null,"ESMS",536,835.2,null,null,null,{"$f":"IFERROR((RANK(T139,$T$3:$T$191,0)+COUNTIF($T$3:T139, T139)-1), \"\")","v":""},{"$f":"IFERROR(INDEX($C$2:$C$1840,_xlfn.AGGREGATE(15,3,(($A$2:$A$1840=$N$3)/($A$2:$A$1840=$N$3)*ROW($A$2:$A$1840))-ROW($A$1), ROWS($M$3:M139))), \"\")","v":""},{"$f":"IFERROR(INDEX($B$2:$B$1840,_xlfn.AGGREGATE(15,3,(($A$2:$A$1840=$N$3)/($A$2:$A$1840=$N$3)*ROW($A$2:$A$1840))-ROW($A$1), ROWS($M$3:M139))), \"\")","v":""},{"$f":"IFERROR(INDEX($J$2:$J$1840,_xlfn.AGGREGATE(15,3,(($A$2:$A$1840=$N$3)/($A$2:$A$1840=$N$3)*ROW($A$2:$A$1840))-ROW($A$1), ROWS($M$3:M139))), \"\")","v":""},{"$f":"IFERROR(INDEX($G$2:$G$1840,_xlfn.AGGREGATE(15,3,(($A$2:$A$1840=$N$3)/($A$2:$A$1840=$N$3)*ROW($A$2:$A$1840))-ROW($A$1), ROWS($M$3:M139))), \"\")","v":""},""]
["0035","Edward Everett","00350088",null,"PK - 06","SW",275,null,"ES",197,300.8,null,null,null,{"$f":"IFERROR((RANK(T140,$T$3:$T$191,0)+COUNTIF($T$3:T140, T140)-1), \"\")","v":""},{"$f":"IFERROR(INDEX($C$2:$C$1840,_xlfn.AGGREGATE(15,3,(($A$2:$A$1840=$N$3)/($A$2:$A$1840=$N$3)*ROW($A$2:$A$1840))-ROW($A$1), ROWS($M$3:M140))), \"\")","v":""},{"$f":"IFERROR(INDEX($B$2:$B$1840,_xlfn.AGGREGATE(15,3,(($A$2:$A$1840=$N$3)/($A$2:$A$1840=$N$3)*ROW($A$2:$A$1840))-ROW($A$1), ROWS($M$3:M140))), \"\")","v":""},{"$f":"IFERROR(INDEX($J$2:$J$1840,_xlfn.AGGREGATE(15,3,(($A$2:$A$1840=$N$3)/($A$2:$A$1840=$N$3)*ROW($A$2:$A$1840))-ROW($A$1), ROWS($M$3:M140))), \"\")","v":""},{"$f":"IFERROR(INDEX($G$2:$G$1840,_xlfn.AGGREGATE(15,3,(($A$2:$A$1840=$N$3)/($A$2:$A$1840=$N$3)*ROW($A$2:$A$1840))-ROW($A$1), ROWS($M$3:M140))), \"\")","v":""},""]
["0035","Eliot Elementary","00350096",null,"PK - 08","SW",786,null,"ESMS",177,273.60000000000002,null,null,null,{"$f":"IFERROR((RANK(T141,$T$3:$T$191,0)+COUNTIF($T$3:T141, T141)-1), \"\")","v":""},{"$f":"IFERROR(INDEX($C$2:$C$1840,_xlfn.AGGREGATE(15,3,(($A$2:$A$1840=$N$3)/($A$2:$A$1840=$N$3)*ROW($A$2:$A$1840))-ROW($A$1), ROWS($M$3:M141))), \"\")","v":""},{"$f":"IFERROR(INDEX($B$2:$B$1840,_xlfn.AGGREGATE(15,3,(($A$2:$A$1840=$N$3)/($A$2:$A$1840=$N$3)*ROW($A$2:$A$1840))-ROW($A$1), ROWS($M$3:M141))), \"\")","v":""},{"$f":"IFERROR(INDEX($J$2:$J$1840,_xlfn.AGGREGATE(15,3,(($A$2:$A$1840=$N$3)/($A$2:$A$1840=$N$3)*ROW($A$2:$A$1840))-ROW($A$1), ROWS($M$3:M141))), \"\")","v":""},{"$f":"IFERROR(INDEX($G$2:$G$1840,_xlfn.AGGREGATE(15,3,(($A$2:$A$1840=$N$3)/($A$2:$A$1840=$N$3)*ROW($A$2:$A$1840))-ROW($A$1), ROWS($M$3:M141))), \"\")","v":""},""]
["0035","Ellis Mendell","00350100",null,"PK - 05","SW",275,null,"ES",138,201.60000000000002,null,null,null,{"$f":"IFERROR((RANK(T142,$T$3:$T$191,0)+COUNTIF($T$3:T142, T142)-1), \"\")","v":""},{"$f":"IFERROR(INDEX($C$2:$C$1840,_xlfn.AGGREGATE(15,3,(($A$2:$A$1840=$N$3)/($A$2:$A$1840=$N$3)*ROW($A$2:$A$1840))-ROW($A$1), ROWS($M$3:M142))), \"\")","v":""},{"$f":"IFERROR(INDEX($B$2:$B$1840,_xlfn.AGGREGATE(15,3,(($A$2:$A$1840=$N$3)/($A$2:$A$1840=$N$3)*ROW($A$2:$A$1840))-ROW($A$1), ROWS($M$3:M142))), \"\")","v":""},{"$f":"IFERROR(INDEX($J$2:$J$1840,_xlfn.AGGREGATE(15,3,(($A$2:$A$1840=$N$3)/($A$2:$A$1840=$N$3)*ROW($A$2:$A$1840))-ROW($A$1), ROWS($M$3:M142))), \"\")","v":""},{"$f":"IFERROR(INDEX($G$2:$G$1840,_xlfn.AGGREGATE(15,3,(($A$2:$A$1840=$N$3)/($A$2:$A$1840=$N$3)*ROW($A$2:$A$1840))-ROW($A$1), ROWS($M$3:M142))), \"\")","v":""},""]
["0035","Franklin D Roosevelt","00350116",null,"PK - 08","SW",411,null,"ESMS",249,358.40000000000003,null,null,null,{"$f":"IFERROR((RANK(T143,$T$3:$T$191,0)+COUNTIF($T$3:T143, T143)-1), \"\")","v":""},{"$f":"IFERROR(INDEX($C$2:$C$1840,_xlfn.AGGREGATE(15,3,(($A$2:$A$1840=$N$3)/($A$2:$A$1840=$N$3)*ROW($A$2:$A$1840))-ROW($A$1), ROWS($M$3:M143))), \"\")","v":""},{"$f":"IFERROR(INDEX($B$2:$B$1840,_xlfn.AGGREGATE(15,3,(($A$2:$A$1840=$N$3)/($A$2:$A$1840=$N$3)*ROW($A$2:$A$1840))-ROW($A$1), ROWS($M$3:M143))), \"\")","v":""},{"$f":"IFERROR(INDEX($J$2:$J$1840,_xlfn.AGGREGATE(15,3,(($A$2:$A$1840=$N$3)/($A$2:$A$1840=$N$3)*ROW($A$2:$A$1840))-ROW($A$1), ROWS($M$3:M143))), \"\")","v":""},{"$f":"IFERROR(INDEX($G$2:$G$1840,_xlfn.AGGREGATE(15,3,(($A$2:$A$1840=$N$3)/($A$2:$A$1840=$N$3)*ROW($A$2:$A$1840))-ROW($A$1), ROWS($M$3:M143))), \"\")","v":""},""]
["0035","George H Conley","00350122",null,"PK - 06","SW",197,null,"ES",105,153.60000000000002,null,null,null,{"$f":"IFERROR((RANK(T144,$T$3:$T$191,0)+COUNTIF($T$3:T144, T144)-1), \"\")","v":""},{"$f":"IFERROR(INDEX($C$2:$C$1840,_xlfn.AGGREGATE(15,3,(($A$2:$A$1840=$N$3)/($A$2:$A$1840=$N$3)*ROW($A$2:$A$1840))-ROW($A$1), ROWS($M$3:M144))), \"\")","v":""},{"$f":"IFERROR(INDEX($B$2:$B$1840,_xlfn.AGGREGATE(15,3,(($A$2:$A$1840=$N$3)/($A$2:$A$1840=$N$3)*ROW($A$2:$A$1840))-ROW($A$1), ROWS($M$3:M144))), \"\")","v":""},{"$f":"IFERROR(INDEX($J$2:$J$1840,_xlfn.AGGREGATE(15,3,(($A$2:$A$1840=$N$3)/($A$2:$A$1840=$N$3)*ROW($A$2:$A$1840))-ROW($A$1), ROWS($M$3:M144))), \"\")","v":""},{"$f":"IFERROR(INDEX($G$2:$G$1840,_xlfn.AGGREGATE(15,3,(($A$2:$A$1840=$N$3)/($A$2:$A$1840=$N$3)*ROW($A$2:$A$1840))-ROW($A$1), ROWS($M$3:M144))), \"\")","v":""},""]
["0035","Henry Grew","00350135",null,"PK - 05","SW",217,null,"ES",151,222.4,null,null,null,{"$f":"IFERROR((RANK(T145,$T$3:$T$191,0)+COUNTIF($T$3:T145, T145)-1), \"\")","v":""},{"$f":"IFERROR(INDEX($C$2:$C$1840,_xlfn.AGGREGATE(15,3,(($A$2:$A$1840=$N$3)/($A$2:$A$1840=$N$3)*ROW($A$2:$A$1840))-ROW($A$1), ROWS($M$3:M145))), \"\")","v":""},{"$f":"IFERROR(INDEX($B$2:$B$1840,_xlfn.AGGREGATE(15,3,(($A$2:$A$1840=$N$3)/($A$2:$A$1840=$N$3)*ROW($A$2:$A$1840))-ROW($A$1), ROWS($M$3:M145))), \"\")","v":""},{"$f":"IFERROR(INDEX($J$2:$J$1840,_xlfn.AGGREGATE(15,3,(($A$2:$A$1840=$N$3)/($A$2:$A$1840=$N$3)*ROW($A$2:$A$1840))-ROW($A$1), ROWS($M$3:M145))), \"\")","v":""},{"$f":"IFERROR(INDEX($G$2:$G$1840,_xlfn.AGGREGATE(15,3,(($A$2:$A$1840=$N$3)/($A$2:$A$1840=$N$3)*ROW($A$2:$A$1840))-ROW($A$1), ROWS($M$3:M145))), \"\")","v":""},""]
["0035","O W Holmes","00350138",null,"PK - 05","SW",286,null,"ES",239,353.6,null,null,null,{"$f":"IFERROR((RANK(T146,$T$3:$T$191,0)+COUNTIF($T$3:T146, T146)-1), \"\")","v":""},{"$f":"IFERROR(INDEX($C$2:$C$1840,_xlfn.AGGREGATE(15,3,(($A$2:$A$1840=$N$3)/($A$2:$A$1840=$N$3)*ROW($A$2:$A$1840))-ROW($A$1), ROWS($M$3:M146))), \"\")","v":""},{"$f":"IFERROR(INDEX($B$2:$B$1840,_xlfn.AGGREGATE(15,3,(($A$2:$A$1840=$N$3)/($A$2:$A$1840=$N$3)*ROW($A$2:$A$1840))-ROW($A$1), ROWS($M$3:M146))), \"\")","v":""},{"$f":"IFERROR(INDEX($J$2:$J$1840,_xlfn.AGGREGATE(15,3,(($A$2:$A$1840=$N$3)/($A$2:$A$1840=$N$3)*ROW($A$2:$A$1840))-ROW($A$1), ROWS($M$3:M146))), \"\")","v":""},{"$f":"IFERROR(INDEX($G$2:$G$1840,_xlfn.AGGREGATE(15,3,(($A$2:$A$1840=$N$3)/($A$2:$A$1840=$N$3)*ROW($A$2:$A$1840))-ROW($A$1), ROWS($M$3:M146))), \"\")","v":""},""]
["0035","Hugh Roe O'Donnell","00350141",null,"PK - 06","SW",274,null,"ES",200,302.40000000000003,null,null,null,{"$f":"IFERROR((RANK(T147,$T$3:$T$191,0)+COUNTIF($T$3:T147, T147)-1), \"\")","v":""},{"$f":"IFERROR(INDEX($C$2:$C$1840,_xlfn.AGGREGATE(15,3,(($A$2:$A$1840=$N$3)/($A$2:$A$1840=$N$3)*ROW($A$2:$A$1840))-ROW($A$1), ROWS($M$3:M147))), \"\")","v":""},{"$f":"IFERROR(INDEX($B$2:$B$1840,_xlfn.AGGREGATE(15,3,(($A$2:$A$1840=$N$3)/($A$2:$A$1840=$N$3)*ROW($A$2:$A$1840))-ROW($A$1), ROWS($M$3:M147))), \"\")","v":""},{"$f":"IFERROR(INDEX($J$2:$J$1840,_xlfn.AGGREGATE(15,3,(($A$2:$A$1840=$N$3)/($A$2:$A$1840=$N$3)*ROW($A$2:$A$1840))-ROW($A$1), ROWS($M$3:M147))), \"\")","v":""},{"$f":"IFERROR(INDEX($G$2:$G$1840,_xlfn.AGGREGATE(15,3,(($A$2:$A$1840=$N$3)/($A$2:$A$1840=$N$3)*ROW($A$2:$A$1840))-ROW($A$1), ROWS($M$3:M147))), \"\")","v":""},""]
["0035","Condon K-8","00350146",null,"PK - 08","SW",738,null,"ESMS",551,840,null,null,null,{"$f":"IFERROR((RANK(T148,$T$3:$T$191,0)+COUNTIF($T$3:T148, T148)-1), \"\")","v":""},{"$f":"IFERROR(INDEX($C$2:$C$1840,_xlfn.AGGREGATE(15,3,(($A$2:$A$1840=$N$3)/($A$2:$A$1840=$N$3)*ROW($A$2:$A$1840))-ROW($A$1), ROWS($M$3:M148))), \"\")","v":""},{"$f":"IFERROR(INDEX($B$2:$B$1840,_xlfn.AGGREGATE(15,3,(($A$2:$A$1840=$N$3)/($A$2:$A$1840=$N$3)*ROW($A$2:$A$1840))-ROW($A$1), ROWS($M$3:M148))), \"\")","v":""},{"$f":"IFERROR(INDEX($J$2:$J$1840,_xlfn.AGGREGATE(15,3,(($A$2:$A$1840=$N$3)/($A$2:$A$1840=$N$3)*ROW($A$2:$A$1840))-ROW($A$1), ROWS($M$3:M148))), \"\")","v":""},{"$f":"IFERROR(INDEX($G$2:$G$1840,_xlfn.AGGREGATE(15,3,(($A$2:$A$1840=$N$3)/($A$2:$A$1840=$N$3)*ROW($A$2:$A$1840))-ROW($A$1), ROWS($M$3:M148))), \"\")","v":""},""]
["0035","James W Hennigan","00350153",null,"K - 08","SW",537,null,"ESMS",454,726.40000000000009,null,null,null,{"$f":"IFERROR((RANK(T149,$T$3:$T$191,0)+COUNTIF($T$3:T149, T149)-1), \"\")","v":""},{"$f":"IFERROR(INDEX($C$2:$C$1840,_xlfn.AGGREGATE(15,3,(($A$2:$A$1840=$N$3)/($A$2:$A$1840=$N$3)*ROW($A$2:$A$1840))-ROW($A$1), ROWS($M$3:M149))), \"\")","v":""},{"$f":"IFERROR(INDEX($B$2:$B$1840,_xlfn.AGGREGATE(15,3,(($A$2:$A$1840=$N$3)/($A$2:$A$1840=$N$3)*ROW($A$2:$A$1840))-ROW($A$1), ROWS($M$3:M149))), \"\")","v":""},{"$f":"IFERROR(INDEX($J$2:$J$1840,_xlfn.AGGREGATE(15,3,(($A$2:$A$1840=$N$3)/($A$2:$A$1840=$N$3)*ROW($A$2:$A$1840))-ROW($A$1), ROWS($M$3:M149))), \"\")","v":""},{"$f":"IFERROR(INDEX($G$2:$G$1840,_xlfn.AGGREGATE(15,3,(($A$2:$A$1840=$N$3)/($A$2:$A$1840=$N$3)*ROW($A$2:$A$1840))-ROW($A$1), ROWS($M$3:M149))), \"\")","v":""},""]
["0035","James J Chittick","00350154",null,"PK - 05","SW",239,null,"ES",188,265.60000000000002,null,null,null,{"$f":"IFERROR((RANK(T150,$T$3:$T$191,0)+COUNTIF($T$3:T150, T150)-1), \"\")","v":""},{"$f":"IFERROR(INDEX($C$2:$C$1840,_xlfn.AGGREGATE(15,3,(($A$2:$A$1840=$N$3)/($A$2:$A$1840=$N$3)*ROW($A$2:$A$1840))-ROW($A$1), ROWS($M$3:M150))), \"\")","v":""},{"$f":"IFERROR(INDEX($B$2:$B$1840,_xlfn.AGGREGATE(15,3,(($A$2:$A$1840=$N$3)/($A$2:$A$1840=$N$3)*ROW($A$2:$A$1840))-ROW($A$1), ROWS($M$3:M150))), \"\")","v":""},{"$f":"IFERROR(INDEX($J$2:$J$1840,_xlfn.AGGREGATE(15,3,(($A$2:$A$1840=$N$3)/($A$2:$A$1840=$N$3)*ROW($A$2:$A$1840))-ROW($A$1), ROWS($M$3:M150))), \"\")","v":""},{"$f":"IFERROR(INDEX($G$2:$G$1840,_xlfn.AGGREGATE(15,3,(($A$2:$A$1840=$N$3)/($A$2:$A$1840=$N$3)*ROW($A$2:$A$1840))-ROW($A$1), ROWS($M$3:M150))), \"\")","v":""},""]
["0035","James Otis","00350156",null,"PK - 06","SW",411,null,"ES",267,390.40000000000003,null,null,null,{"$f":"IFERROR((RANK(T151,$T$3:$T$191,0)+COUNTIF($T$3:T151, T151)-1), \"\")","v":""},{"$f":"IFERROR(INDEX($C$2:$C$1840,_xlfn.AGGREGATE(15,3,(($A$2:$A$1840=$N$3)/($A$2:$A$1840=$N$3)*ROW($A$2:$A$1840))-ROW($A$1), ROWS($M$3:M151))), \"\")","v":""},{"$f":"IFERROR(INDEX($B$2:$B$1840,_xlfn.AGGREGATE(15,3,(($A$2:$A$1840=$N$3)/($A$2:$A$1840=$N$3)*ROW($A$2:$A$1840))-ROW($A$1), ROWS($M$3:M151))), \"\")","v":""},{"$f":"IFERROR(INDEX($J$2:$J$1840,_xlfn.AGGREGATE(15,3,(($A$2:$A$1840=$N$3)/($A$2:$A$1840=$N$3)*ROW($A$2:$A$1840))-ROW($A$1), ROWS($M$3:M151))), \"\")","v":""},{"$f":"IFERROR(INDEX($G$2:$G$1840,_xlfn.AGGREGATE(15,3,(($A$2:$A$1840=$N$3)/($A$2:$A$1840=$N$3)*ROW($A$2:$A$1840))-ROW($A$1), ROWS($M$3:M151))), \"\")","v":""},""]
["0035","John F Kennedy","00350166",null,"PK - 05","SW",352,null,"ES",247,366.40000000000003,null,null,null,{"$f":"IFERROR((RANK(T152,$T$3:$T$191,0)+COUNTIF($T$3:T152, T152)-1), \"\")","v":""},{"$f":"IFERROR(INDEX($C$2:$C$1840,_xlfn.AGGREGATE(15,3,(($A$2:$A$1840=$N$3)/($A$2:$A$1840=$N$3)*ROW($A$2:$A$1840))-ROW($A$1), ROWS($M$3:M152))), \"\")","v":""},{"$f":"IFERROR(INDEX($B$2:$B$1840,_xlfn.AGGREGATE(15,3,(($A$2:$A$1840=$N$3)/($A$2:$A$1840=$N$3)*ROW($A$2:$A$1840))-ROW($A$1), ROWS($M$3:M152))), \"\")","v":""},{"$f":"IFERROR(INDEX($J$2:$J$1840,_xlfn.AGGREGATE(15,3,(($A$2:$A$1840=$N$3)/($A$2:$A$1840=$N$3)*ROW($A$2:$A$1840))-ROW($A$1), ROWS($M$3:M152))), \"\")","v":""},{"$f":"IFERROR(INDEX($G$2:$G$1840,_xlfn.AGGREGATE(15,3,(($A$2:$A$1840=$N$3)/($A$2:$A$1840=$N$3)*ROW($A$2:$A$1840))-ROW($A$1), ROWS($M$3:M152))), \"\")","v":""},""]
["0035","UP Academy Holland","00350167",null,"PK - 05","SW",686,null,"ES",579,849.6,null,null,null,{"$f":"IFERROR((RANK(T153,$T$3:$T$191,0)+COUNTIF($T$3:T153, T153)-1), \"\")","v":""},{"$f":"IFERROR(INDEX($C$2:$C$1840,_xlfn.AGGREGATE(15,3,(($A$2:$A$1840=$N$3)/($A$2:$A$1840=$N$3)*ROW($A$2:$A$1840))-ROW($A$1), ROWS($M$3:M153))), \"\")","v":""},{"$f":"IFERROR(INDEX($B$2:$B$1840,_xlfn.AGGREGATE(15,3,(($A$2:$A$1840=$N$3)/($A$2:$A$1840=$N$3)*ROW($A$2:$A$1840))-ROW($A$1), ROWS($M$3:M153))), \"\")","v":""},{"$f":"IFERROR(INDEX($J$2:$J$1840,_xlfn.AGGREGATE(15,3,(($A$2:$A$1840=$N$3)/($A$2:$A$1840=$N$3)*ROW($A$2:$A$1840))-ROW($A$1), ROWS($M$3:M153))), \"\")","v":""},{"$f":"IFERROR(INDEX($G$2:$G$1840,_xlfn.AGGREGATE(15,3,(($A$2:$A$1840=$N$3)/($A$2:$A$1840=$N$3)*ROW($A$2:$A$1840))-ROW($A$1), ROWS($M$3:M153))), \"\")","v":""},""]
["0035","John D Philbrick","00350172",null,"PK - 05","SW",109,null,"ES",71,96,null,null,null,{"$f":"IFERROR((RANK(T154,$T$3:$T$191,0)+COUNTIF($T$3:T154, T154)-1), \"\")","v":""},{"$f":"IFERROR(INDEX($C$2:$C$1840,_xlfn.AGGREGATE(15,3,(($A$2:$A$1840=$N$3)/($A$2:$A$1840=$N$3)*ROW($A$2:$A$1840))-ROW($A$1), ROWS($M$3:M154))), \"\")","v":""},{"$f":"IFERROR(INDEX($B$2:$B$1840,_xlfn.AGGREGATE(15,3,(($A$2:$A$1840=$N$3)/($A$2:$A$1840=$N$3)*ROW($A$2:$A$1840))-ROW($A$1), ROWS($M$3:M154))), \"\")","v":""},{"$f":"IFERROR(INDEX($J$2:$J$1840,_xlfn.AGGREGATE(15,3,(($A$2:$A$1840=$N$3)/($A$2:$A$1840=$N$3)*ROW($A$2:$A$1840))-ROW($A$1), ROWS($M$3:M154))), \"\")","v":""},{"$f":"IFERROR(INDEX($G$2:$G$1840,_xlfn.AGGREGATE(15,3,(($A$2:$A$1840=$N$3)/($A$2:$A$1840=$N$3)*ROW($A$2:$A$1840))-ROW($A$1), ROWS($M$3:M154))), \"\")","v":""},""]
["0035","John W McCormack","00350179",null,"06 - 08","SW",260,null,"MS",218,348.8,null,null,null,{"$f":"IFERROR((RANK(T155,$T$3:$T$191,0)+COUNTIF($T$3:T155, T155)-1), \"\")","v":""},{"$f":"IFERROR(INDEX($C$2:$C$1840,_xlfn.AGGREGATE(15,3,(($A$2:$A$1840=$N$3)/($A$2:$A$1840=$N$3)*ROW($A$2:$A$1840))-ROW($A$1), ROWS($M$3:M155))), \"\")","v":""},{"$f":"IFERROR(INDEX($B$2:$B$1840,_xlfn.AGGREGATE(15,3,(($A$2:$A$1840=$N$3)/($A$2:$A$1840=$N$3)*ROW($A$2:$A$1840))-ROW($A$1), ROWS($M$3:M155))), \"\")","v":""},{"$f":"IFERROR(INDEX($J$2:$J$1840,_xlfn.AGGREGATE(15,3,(($A$2:$A$1840=$N$3)/($A$2:$A$1840=$N$3)*ROW($A$2:$A$1840))-ROW($A$1), ROWS($M$3:M155))), \"\")","v":""},{"$f":"IFERROR(INDEX($G$2:$G$1840,_xlfn.AGGREGATE(15,3,(($A$2:$A$1840=$N$3)/($A$2:$A$1840=$N$3)*ROW($A$2:$A$1840))-ROW($A$1), ROWS($M$3:M155))), \"\")","v":""},""]
["0035","John Winthrop","00350180",null,"PK - 05","SW",224,null,"ES",189,273.60000000000002,null,null,null,{"$f":"IFERROR((RANK(T156,$T$3:$T$191,0)+COUNTIF($T$3:T156, T156)-1), \"\")","v":""},{"$f":"IFERROR(INDEX($C$2:$C$1840,_xlfn.AGGREGATE(15,3,(($A$2:$A$1840=$N$3)/($A$2:$A$1840=$N$3)*ROW($A$2:$A$1840))-ROW($A$1), ROWS($M$3:M156))), \"\")","v":""},{"$f":"IFERROR(INDEX($B$2:$B$1840,_xlfn.AGGREGATE(15,3,(($A$2:$A$1840=$N$3)/($A$2:$A$1840=$N$3)*ROW($A$2:$A$1840))-ROW($A$1), ROWS($M$3:M156))), \"\")","v":""},{"$f":"IFERROR(INDEX($J$2:$J$1840,_xlfn.AGGREGATE(15,3,(($A$2:$A$1840=$N$3)/($A$2:$A$1840=$N$3)*ROW($A$2:$A$1840))-ROW($A$1), ROWS($M$3:M156))), \"\")","v":""},{"$f":"IFERROR(INDEX($G$2:$G$1840,_xlfn.AGGREGATE(15,3,(($A$2:$A$1840=$N$3)/($A$2:$A$1840=$N$3)*ROW($A$2:$A$1840))-ROW($A$1), ROWS($M$3:M156))), \"\")","v":""},""]
["0035","Joseph P Tynan","00350181",null,"PK - 06","SW",241,null,"ES",196,280,null,null,null,{"$f":"IFERROR((RANK(T157,$T$3:$T$191,0)+COUNTIF($T$3:T157, T157)-1), \"\")","v":""},{"$f":"IFERROR(INDEX($C$2:$C$1840,_xlfn.AGGREGATE(15,3,(($A$2:$A$1840=$N$3)/($A$2:$A$1840=$N$3)*ROW($A$2:$A$1840))-ROW($A$1), ROWS($M$3:M157))), \"\")","v":""},{"$f":"IFERROR(INDEX($B$2:$B$1840,_xlfn.AGGREGATE(15,3,(($A$2:$A$1840=$N$3)/($A$2:$A$1840=$N$3)*ROW($A$2:$A$1840))-ROW($A$1), ROWS($M$3:M157))), \"\")","v":""},{"$f":"IFERROR(INDEX($J$2:$J$1840,_xlfn.AGGREGATE(15,3,(($A$2:$A$1840=$N$3)/($A$2:$A$1840=$N$3)*ROW($A$2:$A$1840))-ROW($A$1), ROWS($M$3:M157))), \"\")","v":""},{"$f":"IFERROR(INDEX($G$2:$G$1840,_xlfn.AGGREGATE(15,3,(($A$2:$A$1840=$N$3)/($A$2:$A$1840=$N$3)*ROW($A$2:$A$1840))-ROW($A$1), ROWS($M$3:M157))), \"\")","v":""},""]
["0035","Joseph J Hurley","00350182",null,"PK - 08","SW",362,null,"ESMS",212,315.20000000000005,null,null,null,{"$f":"IFERROR((RANK(T158,$T$3:$T$191,0)+COUNTIF($T$3:T158, T158)-1), \"\")","v":""},{"$f":"IFERROR(INDEX($C$2:$C$1840,_xlfn.AGGREGATE(15,3,(($A$2:$A$1840=$N$3)/($A$2:$A$1840=$N$3)*ROW($A$2:$A$1840))-ROW($A$1), ROWS($M$3:M158))), \"\")","v":""},{"$f":"IFERROR(INDEX($B$2:$B$1840,_xlfn.AGGREGATE(15,3,(($A$2:$A$1840=$N$3)/($A$2:$A$1840=$N$3)*ROW($A$2:$A$1840))-ROW($A$1), ROWS($M$3:M158))), \"\")","v":""},{"$f":"IFERROR(INDEX($J$2:$J$1840,_xlfn.AGGREGATE(15,3,(($A$2:$A$1840=$N$3)/($A$2:$A$1840=$N$3)*ROW($A$2:$A$1840))-ROW($A$1), ROWS($M$3:M158))), \"\")","v":""},{"$f":"IFERROR(INDEX($G$2:$G$1840,_xlfn.AGGREGATE(15,3,(($A$2:$A$1840=$N$3)/($A$2:$A$1840=$N$3)*ROW($A$2:$A$1840))-ROW($A$1), ROWS($M$3:M158))), \"\")","v":""},""]
["0035","Joseph Lee","00350183",null,"PK - 08","SW",620,null,"ESMS",483,699.2,null,null,null,{"$f":"IFERROR((RANK(T159,$T$3:$T$191,0)+COUNTIF($T$3:T159, T159)-1), \"\")","v":""},{"$f":"IFERROR(INDEX($C$2:$C$1840,_xlfn.AGGREGATE(15,3,(($A$2:$A$1840=$N$3)/($A$2:$A$1840=$N$3)*ROW($A$2:$A$1840))-ROW($A$1), ROWS($M$3:M159))), \"\")","v":""},{"$f":"IFERROR(INDEX($B$2:$B$1840,_xlfn.AGGREGATE(15,3,(($A$2:$A$1840=$N$3)/($A$2:$A$1840=$N$3)*ROW($A$2:$A$1840))-ROW($A$1), ROWS($M$3:M159))), \"\")","v":""},{"$f":"IFERROR(INDEX($J$2:$J$1840,_xlfn.AGGREGATE(15,3,(($A$2:$A$1840=$N$3)/($A$2:$A$1840=$N$3)*ROW($A$2:$A$1840))-ROW($A$1), ROWS($M$3:M159))), \"\")","v":""},{"$f":"IFERROR(INDEX($G$2:$G$1840,_xlfn.AGGREGATE(15,3,(($A$2:$A$1840=$N$3)/($A$2:$A$1840=$N$3)*ROW($A$2:$A$1840))-ROW($A$1), ROWS($M$3:M159))), \"\")","v":""},""]
["0035","Joseph P Manning","00350184",null,"PK - 06","SW",177,null,"ES",49,70.400000000000006,null,null,null,{"$f":"IFERROR((RANK(T160,$T$3:$T$191,0)+COUNTIF($T$3:T160, T160)-1), \"\")","v":""},{"$f":"IFERROR(INDEX($C$2:$C$1840,_xlfn.AGGREGATE(15,3,(($A$2:$A$1840=$N$3)/($A$2:$A$1840=$N$3)*ROW($A$2:$A$1840))-ROW($A$1), ROWS($M$3:M160))), \"\")","v":""},{"$f":"IFERROR(INDEX($B$2:$B$1840,_xlfn.AGGREGATE(15,3,(($A$2:$A$1840=$N$3)/($A$2:$A$1840=$N$3)*ROW($A$2:$A$1840))-ROW($A$1), ROWS($M$3:M160))), \"\")","v":""},{"$f":"IFERROR(INDEX($J$2:$J$1840,_xlfn.AGGREGATE(15,3,(($A$2:$A$1840=$N$3)/($A$2:$A$1840=$N$3)*ROW($A$2:$A$1840))-ROW($A$1), ROWS($M$3:M160))), \"\")","v":""},{"$f":"IFERROR(INDEX($G$2:$G$1840,_xlfn.AGGREGATE(15,3,(($A$2:$A$1840=$N$3)/($A$2:$A$1840=$N$3)*ROW($A$2:$A$1840))-ROW($A$1), ROWS($M$3:M160))), \"\")","v":""},""]
["0035","Joyce Kilmer","00350190",null,"PK - 08","SW",428,null,"ESMS",159,238.4,null,null,null,{"$f":"IFERROR((RANK(T161,$T$3:$T$191,0)+COUNTIF($T$3:T161, T161)-1), \"\")","v":""},{"$f":"IFERROR(INDEX($C$2:$C$1840,_xlfn.AGGREGATE(15,3,(($A$2:$A$1840=$N$3)/($A$2:$A$1840=$N$3)*ROW($A$2:$A$1840))-ROW($A$1), ROWS($M$3:M161))), \"\")","v":""},{"$f":"IFERROR(INDEX($B$2:$B$1840,_xlfn.AGGREGATE(15,3,(($A$2:$A$1840=$N$3)/($A$2:$A$1840=$N$3)*ROW($A$2:$A$1840))-ROW($A$1), ROWS($M$3:M161))), \"\")","v":""},{"$f":"IFERROR(INDEX($J$2:$J$1840,_xlfn.AGGREGATE(15,3,(($A$2:$A$1840=$N$3)/($A$2:$A$1840=$N$3)*ROW($A$2:$A$1840))-ROW($A$1), ROWS($M$3:M161))), \"\")","v":""},{"$f":"IFERROR(INDEX($G$2:$G$1840,_xlfn.AGGREGATE(15,3,(($A$2:$A$1840=$N$3)/($A$2:$A$1840=$N$3)*ROW($A$2:$A$1840))-ROW($A$1), ROWS($M$3:M161))), \"\")","v":""},""]
["0035","Harvard-Kent","00350200",null,"PK - 06","SW",389,null,"ES",275,408,null,null,null,{"$f":"IFERROR((RANK(T162,$T$3:$T$191,0)+COUNTIF($T$3:T162, T162)-1), \"\")","v":""},{"$f":"IFERROR(INDEX($C$2:$C$1840,_xlfn.AGGREGATE(15,3,(($A$2:$A$1840=$N$3)/($A$2:$A$1840=$N$3)*ROW($A$2:$A$1840))-ROW($A$1), ROWS($M$3:M162))), \"\")","v":""},{"$f":"IFERROR(INDEX($B$2:$B$1840,_xlfn.AGGREGATE(15,3,(($A$2:$A$1840=$N$3)/($A$2:$A$1840=$N$3)*ROW($A$2:$A$1840))-ROW($A$1), ROWS($M$3:M162))), \"\")","v":""},{"$f":"IFERROR(INDEX($J$2:$J$1840,_xlfn.AGGREGATE(15,3,(($A$2:$A$1840=$N$3)/($A$2:$A$1840=$N$3)*ROW($A$2:$A$1840))-ROW($A$1), ROWS($M$3:M162))), \"\")","v":""},{"$f":"IFERROR(INDEX($G$2:$G$1840,_xlfn.AGGREGATE(15,3,(($A$2:$A$1840=$N$3)/($A$2:$A$1840=$N$3)*ROW($A$2:$A$1840))-ROW($A$1), ROWS($M$3:M162))), \"\")","v":""},""]
["0035","Manassah E Bradley","00350215",null,"PK - 06","SW",299,null,"ES",183,262.40000000000003,null,null,null,{"$f":"IFERROR((RANK(T163,$T$3:$T$191,0)+COUNTIF($T$3:T163, T163)-1), \"\")","v":""},{"$f":"IFERROR(INDEX($C$2:$C$1840,_xlfn.AGGREGATE(15,3,(($A$2:$A$1840=$N$3)/($A$2:$A$1840=$N$3)*ROW($A$2:$A$1840))-ROW($A$1), ROWS($M$3:M163))), \"\")","v":""},{"$f":"IFERROR(INDEX($B$2:$B$1840,_xlfn.AGGREGATE(15,3,(($A$2:$A$1840=$N$3)/($A$2:$A$1840=$N$3)*ROW($A$2:$A$1840))-ROW($A$1), ROWS($M$3:M163))), \"\")","v":""},{"$f":"IFERROR(INDEX($J$2:$J$1840,_xlfn.AGGREGATE(15,3,(($A$2:$A$1840=$N$3)/($A$2:$A$1840=$N$3)*ROW($A$2:$A$1840))-ROW($A$1), ROWS($M$3:M163))), \"\")","v":""},{"$f":"IFERROR(INDEX($G$2:$G$1840,_xlfn.AGGREGATE(15,3,(($A$2:$A$1840=$N$3)/($A$2:$A$1840=$N$3)*ROW($A$2:$A$1840))-ROW($A$1), ROWS($M$3:M163))), \"\")","v":""},""]
["0035","Mather","00350227",null,"PK - 05","SW",514,null,"ES",349,499.20000000000005,null,null,null,{"$f":"IFERROR((RANK(T164,$T$3:$T$191,0)+COUNTIF($T$3:T164, T164)-1), \"\")","v":""},{"$f":"IFERROR(INDEX($C$2:$C$1840,_xlfn.AGGREGATE(15,3,(($A$2:$A$1840=$N$3)/($A$2:$A$1840=$N$3)*ROW($A$2:$A$1840))-ROW($A$1), ROWS($M$3:M164))), \"\")","v":""},{"$f":"IFERROR(INDEX($B$2:$B$1840,_xlfn.AGGREGATE(15,3,(($A$2:$A$1840=$N$3)/($A$2:$A$1840=$N$3)*ROW($A$2:$A$1840))-ROW($A$1), ROWS($M$3:M164))), \"\")","v":""},{"$f":"IFERROR(INDEX($J$2:$J$1840,_xlfn.AGGREGATE(15,3,(($A$2:$A$1840=$N$3)/($A$2:$A$1840=$N$3)*ROW($A$2:$A$1840))-ROW($A$1), ROWS($M$3:M164))), \"\")","v":""},{"$f":"IFERROR(INDEX($G$2:$G$1840,_xlfn.AGGREGATE(15,3,(($A$2:$A$1840=$N$3)/($A$2:$A$1840=$N$3)*ROW($A$2:$A$1840))-ROW($A$1), ROWS($M$3:M164))), \"\")","v":""},""]
["0035","Maurice J Tobin","00350229",null,"PK - 08","SW",411,null,"ESMS",331,504,null,null,null,{"$f":"IFERROR((RANK(T165,$T$3:$T$191,0)+COUNTIF($T$3:T165, T165)-1), \"\")","v":""},{"$f":"IFERROR(INDEX($C$2:$C$1840,_xlfn.AGGREGATE(15,3,(($A$2:$A$1840=$N$3)/($A$2:$A$1840=$N$3)*ROW($A$2:$A$1840))-ROW($A$1), ROWS($M$3:M165))), \"\")","v":""},{"$f":"IFERROR(INDEX($B$2:$B$1840,_xlfn.AGGREGATE(15,3,(($A$2:$A$1840=$N$3)/($A$2:$A$1840=$N$3)*ROW($A$2:$A$1840))-ROW($A$1), ROWS($M$3:M165))), \"\")","v":""},{"$f":"IFERROR(INDEX($J$2:$J$1840,_xlfn.AGGREGATE(15,3,(($A$2:$A$1840=$N$3)/($A$2:$A$1840=$N$3)*ROW($A$2:$A$1840))-ROW($A$1), ROWS($M$3:M165))), \"\")","v":""},{"$f":"IFERROR(INDEX($G$2:$G$1840,_xlfn.AGGREGATE(15,3,(($A$2:$A$1840=$N$3)/($A$2:$A$1840=$N$3)*ROW($A$2:$A$1840))-ROW($A$1), ROWS($M$3:M165))), \"\")","v":""},""]
["0035","Michael J Perkins","00350231",null,"PK - 06","SW",171,null,"ES",141,217.60000000000002,null,null,null,{"$f":"IFERROR((RANK(T166,$T$3:$T$191,0)+COUNTIF($T$3:T166, T166)-1), \"\")","v":""},{"$f":"IFERROR(INDEX($C$2:$C$1840,_xlfn.AGGREGATE(15,3,(($A$2:$A$1840=$N$3)/($A$2:$A$1840=$N$3)*ROW($A$2:$A$1840))-ROW($A$1), ROWS($M$3:M166))), \"\")","v":""},{"$f":"IFERROR(INDEX($B$2:$B$1840,_xlfn.AGGREGATE(15,3,(($A$2:$A$1840=$N$3)/($A$2:$A$1840=$N$3)*ROW($A$2:$A$1840))-ROW($A$1), ROWS($M$3:M166))), \"\")","v":""},{"$f":"IFERROR(INDEX($J$2:$J$1840,_xlfn.AGGREGATE(15,3,(($A$2:$A$1840=$N$3)/($A$2:$A$1840=$N$3)*ROW($A$2:$A$1840))-ROW($A$1), ROWS($M$3:M166))), \"\")","v":""},{"$f":"IFERROR(INDEX($G$2:$G$1840,_xlfn.AGGREGATE(15,3,(($A$2:$A$1840=$N$3)/($A$2:$A$1840=$N$3)*ROW($A$2:$A$1840))-ROW($A$1), ROWS($M$3:M166))), \"\")","v":""},""]
["0035","Mozart","00350237",null,"PK - 05","SW",170,null,"ES",65,81.600000000000009,null,null,null,{"$f":"IFERROR((RANK(T167,$T$3:$T$191,0)+COUNTIF($T$3:T167, T167)-1), \"\")","v":""},{"$f":"IFERROR(INDEX($C$2:$C$1840,_xlfn.AGGREGATE(15,3,(($A$2:$A$1840=$N$3)/($A$2:$A$1840=$N$3)*ROW($A$2:$A$1840))-ROW($A$1), ROWS($M$3:M167))), \"\")","v":""},{"$f":"IFERROR(INDEX($B$2:$B$1840,_xlfn.AGGREGATE(15,3,(($A$2:$A$1840=$N$3)/($A$2:$A$1840=$N$3)*ROW($A$2:$A$1840))-ROW($A$1), ROWS($M$3:M167))), \"\")","v":""},{"$f":"IFERROR(INDEX($J$2:$J$1840,_xlfn.AGGREGATE(15,3,(($A$2:$A$1840=$N$3)/($A$2:$A$1840=$N$3)*ROW($A$2:$A$1840))-ROW($A$1), ROWS($M$3:M167))), \"\")","v":""},{"$f":"IFERROR(INDEX($G$2:$G$1840,_xlfn.AGGREGATE(15,3,(($A$2:$A$1840=$N$3)/($A$2:$A$1840=$N$3)*ROW($A$2:$A$1840))-ROW($A$1), ROWS($M$3:M167))), \"\")","v":""},""]
["0035","Richard J Murphy","00350240",null,"PK - 08","SW",911,null,"ESMS",506,776,null,null,null,{"$f":"IFERROR((RANK(T168,$T$3:$T$191,0)+COUNTIF($T$3:T168, T168)-1), \"\")","v":""},{"$f":"IFERROR(INDEX($C$2:$C$1840,_xlfn.AGGREGATE(15,3,(($A$2:$A$1840=$N$3)/($A$2:$A$1840=$N$3)*ROW($A$2:$A$1840))-ROW($A$1), ROWS($M$3:M168))), \"\")","v":""},{"$f":"IFERROR(INDEX($B$2:$B$1840,_xlfn.AGGREGATE(15,3,(($A$2:$A$1840=$N$3)/($A$2:$A$1840=$N$3)*ROW($A$2:$A$1840))-ROW($A$1), ROWS($M$3:M168))), \"\")","v":""},{"$f":"IFERROR(INDEX($J$2:$J$1840,_xlfn.AGGREGATE(15,3,(($A$2:$A$1840=$N$3)/($A$2:$A$1840=$N$3)*ROW($A$2:$A$1840))-ROW($A$1), ROWS($M$3:M168))), \"\")","v":""},{"$f":"IFERROR(INDEX($G$2:$G$1840,_xlfn.AGGREGATE(15,3,(($A$2:$A$1840=$N$3)/($A$2:$A$1840=$N$3)*ROW($A$2:$A$1840))-ROW($A$1), ROWS($M$3:M168))), \"\")","v":""},""]
["0035","Nathan Hale","00350243",null,"PK - 06","SW",179,null,"ES",104,150.4,null,null,null,{"$f":"IFERROR((RANK(T169,$T$3:$T$191,0)+COUNTIF($T$3:T169, T169)-1), \"\")","v":""},{"$f":"IFERROR(INDEX($C$2:$C$1840,_xlfn.AGGREGATE(15,3,(($A$2:$A$1840=$N$3)/($A$2:$A$1840=$N$3)*ROW($A$2:$A$1840))-ROW($A$1), ROWS($M$3:M169))), \"\")","v":""},{"$f":"IFERROR(INDEX($B$2:$B$1840,_xlfn.AGGREGATE(15,3,(($A$2:$A$1840=$N$3)/($A$2:$A$1840=$N$3)*ROW($A$2:$A$1840))-ROW($A$1), ROWS($M$3:M169))), \"\")","v":""},{"$f":"IFERROR(INDEX($J$2:$J$1840,_xlfn.AGGREGATE(15,3,(($A$2:$A$1840=$N$3)/($A$2:$A$1840=$N$3)*ROW($A$2:$A$1840))-ROW($A$1), ROWS($M$3:M169))), \"\")","v":""},{"$f":"IFERROR(INDEX($G$2:$G$1840,_xlfn.AGGREGATE(15,3,(($A$2:$A$1840=$N$3)/($A$2:$A$1840=$N$3)*ROW($A$2:$A$1840))-ROW($A$1), ROWS($M$3:M169))), \"\")","v":""},""]
["0035","Oliver Hazard Perry","00350255",null,"PK - 06,08","SW",195,null,"ESMS",85,128,null,null,null,{"$f":"IFERROR((RANK(T170,$T$3:$T$191,0)+COUNTIF($T$3:T170, T170)-1), \"\")","v":""},{"$f":"IFERROR(INDEX($C$2:$C$1840,_xlfn.AGGREGATE(15,3,(($A$2:$A$1840=$N$3)/($A$2:$A$1840=$N$3)*ROW($A$2:$A$1840))-ROW($A$1), ROWS($M$3:M170))), \"\")","v":""},{"$f":"IFERROR(INDEX($B$2:$B$1840,_xlfn.AGGREGATE(15,3,(($A$2:$A$1840=$N$3)/($A$2:$A$1840=$N$3)*ROW($A$2:$A$1840))-ROW($A$1), ROWS($M$3:M170))), \"\")","v":""},{"$f":"IFERROR(INDEX($J$2:$J$1840,_xlfn.AGGREGATE(15,3,(($A$2:$A$1840=$N$3)/($A$2:$A$1840=$N$3)*ROW($A$2:$A$1840))-ROW($A$1), ROWS($M$3:M170))), \"\")","v":""},{"$f":"IFERROR(INDEX($G$2:$G$1840,_xlfn.AGGREGATE(15,3,(($A$2:$A$1840=$N$3)/($A$2:$A$1840=$N$3)*ROW($A$2:$A$1840))-ROW($A$1), ROWS($M$3:M170))), \"\")","v":""},""]
["0035","Orchard Gardens","00350257",null,"PK - 08","SW",850,null,"ESMS",666,990.40000000000009,null,null,null,{"$f":"IFERROR((RANK(T171,$T$3:$T$191,0)+COUNTIF($T$3:T171, T171)-1), \"\")","v":""},{"$f":"IFERROR(INDEX($C$2:$C$1840,_xlfn.AGGREGATE(15,3,(($A$2:$A$1840=$N$3)/($A$2:$A$1840=$N$3)*ROW($A$2:$A$1840))-ROW($A$1), ROWS($M$3:M171))), \"\")","v":""},{"$f":"IFERROR(INDEX($B$2:$B$1840,_xlfn.AGGREGATE(15,3,(($A$2:$A$1840=$N$3)/($A$2:$A$1840=$N$3)*ROW($A$2:$A$1840))-ROW($A$1), ROWS($M$3:M171))), \"\")","v":""},{"$f":"IFERROR(INDEX($J$2:$J$1840,_xlfn.AGGREGATE(15,3,(($A$2:$A$1840=$N$3)/($A$2:$A$1840=$N$3)*ROW($A$2:$A$1840))-ROW($A$1), ROWS($M$3:M171))), \"\")","v":""},{"$f":"IFERROR(INDEX($G$2:$G$1840,_xlfn.AGGREGATE(15,3,(($A$2:$A$1840=$N$3)/($A$2:$A$1840=$N$3)*ROW($A$2:$A$1840))-ROW($A$1), ROWS($M$3:M171))), \"\")","v":""},""]
["0035","William H Ohrenberger","00350258",null,"03 - 08","SW",536,null,"ESMS",302,483.20000000000005,null,null,null,{"$f":"IFERROR((RANK(T172,$T$3:$T$191,0)+COUNTIF($T$3:T172, T172)-1), \"\")","v":""},{"$f":"IFERROR(INDEX($C$2:$C$1840,_xlfn.AGGREGATE(15,3,(($A$2:$A$1840=$N$3)/($A$2:$A$1840=$N$3)*ROW($A$2:$A$1840))-ROW($A$1), ROWS($M$3:M172))), \"\")","v":""},{"$f":"IFERROR(INDEX($B$2:$B$1840,_xlfn.AGGREGATE(15,3,(($A$2:$A$1840=$N$3)/($A$2:$A$1840=$N$3)*ROW($A$2:$A$1840))-ROW($A$1), ROWS($M$3:M172))), \"\")","v":""},{"$f":"IFERROR(INDEX($J$2:$J$1840,_xlfn.AGGREGATE(15,3,(($A$2:$A$1840=$N$3)/($A$2:$A$1840=$N$3)*ROW($A$2:$A$1840))-ROW($A$1), ROWS($M$3:M172))), \"\")","v":""},{"$f":"IFERROR(INDEX($G$2:$G$1840,_xlfn.AGGREGATE(15,3,(($A$2:$A$1840=$N$3)/($A$2:$A$1840=$N$3)*ROW($A$2:$A$1840))-ROW($A$1), ROWS($M$3:M172))), \"\")","v":""},""]
["0035","Lyndon","00350262",null,"PK - 08","SW",648,null,"ESMS",181,278.40000000000003,null,null,null,{"$f":"IFERROR((RANK(T173,$T$3:$T$191,0)+COUNTIF($T$3:T173, T173)-1), \"\")","v":""},{"$f":"IFERROR(INDEX($C$2:$C$1840,_xlfn.AGGREGATE(15,3,(($A$2:$A$1840=$N$3)/($A$2:$A$1840=$N$3)*ROW($A$2:$A$1840))-ROW($A$1), ROWS($M$3:M173))), \"\")","v":""},{"$f":"IFERROR(INDEX($B$2:$B$1840,_xlfn.AGGREGATE(15,3,(($A$2:$A$1840=$N$3)/($A$2:$A$1840=$N$3)*ROW($A$2:$A$1840))-ROW($A$1), ROWS($M$3:M173))), \"\")","v":""},{"$f":"IFERROR(INDEX($J$2:$J$1840,_xlfn.AGGREGATE(15,3,(($A$2:$A$1840=$N$3)/($A$2:$A$1840=$N$3)*ROW($A$2:$A$1840))-ROW($A$1), ROWS($M$3:M173))), \"\")","v":""},{"$f":"IFERROR(INDEX($G$2:$G$1840,_xlfn.AGGREGATE(15,3,(($A$2:$A$1840=$N$3)/($A$2:$A$1840=$N$3)*ROW($A$2:$A$1840))-ROW($A$1), ROWS($M$3:M173))), \"\")","v":""},""]
["0035","Patrick J Kennedy","00350264",null,"PK - 06","SW",285,null,"ES",210,305.60000000000002,null,null,null,{"$f":"IFERROR((RANK(T174,$T$3:$T$191,0)+COUNTIF($T$3:T174, T174)-1), \"\")","v":""},{"$f":"IFERROR(INDEX($C$2:$C$1840,_xlfn.AGGREGATE(15,3,(($A$2:$A$1840=$N$3)/($A$2:$A$1840=$N$3)*ROW($A$2:$A$1840))-ROW($A$1), ROWS($M$3:M174))), \"\")","v":""},{"$f":"IFERROR(INDEX($B$2:$B$1840,_xlfn.AGGREGATE(15,3,(($A$2:$A$1840=$N$3)/($A$2:$A$1840=$N$3)*ROW($A$2:$A$1840))-ROW($A$1), ROWS($M$3:M174))), \"\")","v":""},{"$f":"IFERROR(INDEX($J$2:$J$1840,_xlfn.AGGREGATE(15,3,(($A$2:$A$1840=$N$3)/($A$2:$A$1840=$N$3)*ROW($A$2:$A$1840))-ROW($A$1), ROWS($M$3:M174))), \"\")","v":""},{"$f":"IFERROR(INDEX($G$2:$G$1840,_xlfn.AGGREGATE(15,3,(($A$2:$A$1840=$N$3)/($A$2:$A$1840=$N$3)*ROW($A$2:$A$1840))-ROW($A$1), ROWS($M$3:M174))), \"\")","v":""},""]
["0035","Dr. William Henderson Lower","00350266",null,"PK - 01","SW",212,null,"EES",101,105.60000000000001,null,null,null,{"$f":"IFERROR((RANK(T175,$T$3:$T$191,0)+COUNTIF($T$3:T175, T175)-1), \"\")","v":""},{"$f":"IFERROR(INDEX($C$2:$C$1840,_xlfn.AGGREGATE(15,3,(($A$2:$A$1840=$N$3)/($A$2:$A$1840=$N$3)*ROW($A$2:$A$1840))-ROW($A$1), ROWS($M$3:M175))), \"\")","v":""},{"$f":"IFERROR(INDEX($B$2:$B$1840,_xlfn.AGGREGATE(15,3,(($A$2:$A$1840=$N$3)/($A$2:$A$1840=$N$3)*ROW($A$2:$A$1840))-ROW($A$1), ROWS($M$3:M175))), \"\")","v":""},{"$f":"IFERROR(INDEX($J$2:$J$1840,_xlfn.AGGREGATE(15,3,(($A$2:$A$1840=$N$3)/($A$2:$A$1840=$N$3)*ROW($A$2:$A$1840))-ROW($A$1), ROWS($M$3:M175))), \"\")","v":""},{"$f":"IFERROR(INDEX($G$2:$G$1840,_xlfn.AGGREGATE(15,3,(($A$2:$A$1840=$N$3)/($A$2:$A$1840=$N$3)*ROW($A$2:$A$1840))-ROW($A$1), ROWS($M$3:M175))), \"\")","v":""},""]
["0035","Paul A Dever","00350268",null,"PK - 05","SW",363,null,"ES",316,460.8,null,null,null,{"$f":"IFERROR((RANK(T176,$T$3:$T$191,0)+COUNTIF($T$3:T176, T176)-1), \"\")","v":""},{"$f":"IFERROR(INDEX($C$2:$C$1840,_xlfn.AGGREGATE(15,3,(($A$2:$A$1840=$N$3)/($A$2:$A$1840=$N$3)*ROW($A$2:$A$1840))-ROW($A$1), ROWS($M$3:M176))), \"\")","v":""},{"$f":"IFERROR(INDEX($B$2:$B$1840,_xlfn.AGGREGATE(15,3,(($A$2:$A$1840=$N$3)/($A$2:$A$1840=$N$3)*ROW($A$2:$A$1840))-ROW($A$1), ROWS($M$3:M176))), \"\")","v":""},{"$f":"IFERROR(INDEX($J$2:$J$1840,_xlfn.AGGREGATE(15,3,(($A$2:$A$1840=$N$3)/($A$2:$A$1840=$N$3)*ROW($A$2:$A$1840))-ROW($A$1), ROWS($M$3:M176))), \"\")","v":""},{"$f":"IFERROR(INDEX($G$2:$G$1840,_xlfn.AGGREGATE(15,3,(($A$2:$A$1840=$N$3)/($A$2:$A$1840=$N$3)*ROW($A$2:$A$1840))-ROW($A$1), ROWS($M$3:M176))), \"\")","v":""},""]
["0035","Phineas Bates","00350278",null,"PK - 05","SW",241,null,"ES",125,187.20000000000002,null,null,null,{"$f":"IFERROR((RANK(T177,$T$3:$T$191,0)+COUNTIF($T$3:T177, T177)-1), \"\")","v":""},{"$f":"IFERROR(INDEX($C$2:$C$1840,_xlfn.AGGREGATE(15,3,(($A$2:$A$1840=$N$3)/($A$2:$A$1840=$N$3)*ROW($A$2:$A$1840))-ROW($A$1), ROWS($M$3:M177))), \"\")","v":""},{"$f":"IFERROR(INDEX($B$2:$B$1840,_xlfn.AGGREGATE(15,3,(($A$2:$A$1840=$N$3)/($A$2:$A$1840=$N$3)*ROW($A$2:$A$1840))-ROW($A$1), ROWS($M$3:M177))), \"\")","v":""},{"$f":"IFERROR(INDEX($J$2:$J$1840,_xlfn.AGGREGATE(15,3,(($A$2:$A$1840=$N$3)/($A$2:$A$1840=$N$3)*ROW($A$2:$A$1840))-ROW($A$1), ROWS($M$3:M177))), \"\")","v":""},{"$f":"IFERROR(INDEX($G$2:$G$1840,_xlfn.AGGREGATE(15,3,(($A$2:$A$1840=$N$3)/($A$2:$A$1840=$N$3)*ROW($A$2:$A$1840))-ROW($A$1), ROWS($M$3:M177))), \"\")","v":""},""]
["0035","Josiah Quincy","00350286",null,"PK - 05","SW",749,null,"ES",395,571.20000000000005,null,null,null,{"$f":"IFERROR((RANK(T178,$T$3:$T$191,0)+COUNTIF($T$3:T178, T178)-1), \"\")","v":""},{"$f":"IFERROR(INDEX($C$2:$C$1840,_xlfn.AGGREGATE(15,3,(($A$2:$A$1840=$N$3)/($A$2:$A$1840=$N$3)*ROW($A$2:$A$1840))-ROW($A$1), ROWS($M$3:M178))), \"\")","v":""},{"$f":"IFERROR(INDEX($B$2:$B$1840,_xlfn.AGGREGATE(15,3,(($A$2:$A$1840=$N$3)/($A$2:$A$1840=$N$3)*ROW($A$2:$A$1840))-ROW($A$1), ROWS($M$3:M178))), \"\")","v":""},{"$f":"IFERROR(INDEX($J$2:$J$1840,_xlfn.AGGREGATE(15,3,(($A$2:$A$1840=$N$3)/($A$2:$A$1840=$N$3)*ROW($A$2:$A$1840))-ROW($A$1), ROWS($M$3:M178))), \"\")","v":""},{"$f":"IFERROR(INDEX($G$2:$G$1840,_xlfn.AGGREGATE(15,3,(($A$2:$A$1840=$N$3)/($A$2:$A$1840=$N$3)*ROW($A$2:$A$1840))-ROW($A$1), ROWS($M$3:M178))), \"\")","v":""},""]
["0035","Roger Clap","00350298",null,"PK - 06","SW",121,null,"ES",97,140.80000000000001,null,null,null,{"$f":"IFERROR((RANK(T179,$T$3:$T$191,0)+COUNTIF($T$3:T179, T179)-1), \"\")","v":""},{"$f":"IFERROR(INDEX($C$2:$C$1840,_xlfn.AGGREGATE(15,3,(($A$2:$A$1840=$N$3)/($A$2:$A$1840=$N$3)*ROW($A$2:$A$1840))-ROW($A$1), ROWS($M$3:M179))), \"\")","v":""},{"$f":"IFERROR(INDEX($B$2:$B$1840,_xlfn.AGGREGATE(15,3,(($A$2:$A$1840=$N$3)/($A$2:$A$1840=$N$3)*ROW($A$2:$A$1840))-ROW($A$1), ROWS($M$3:M179))), \"\")","v":""},{"$f":"IFERROR(INDEX($J$2:$J$1840,_xlfn.AGGREGATE(15,3,(($A$2:$A$1840=$N$3)/($A$2:$A$1840=$N$3)*ROW($A$2:$A$1840))-ROW($A$1), ROWS($M$3:M179))), \"\")","v":""},{"$f":"IFERROR(INDEX($G$2:$G$1840,_xlfn.AGGREGATE(15,3,(($A$2:$A$1840=$N$3)/($A$2:$A$1840=$N$3)*ROW($A$2:$A$1840))-ROW($A$1), ROWS($M$3:M179))), \"\")","v":""},""]
["0035","Samuel Adams","00350302",null,"PK - 06","SW",245,null,"ES",169,249.60000000000002,null,null,null,{"$f":"IFERROR((RANK(T180,$T$3:$T$191,0)+COUNTIF($T$3:T180, T180)-1), \"\")","v":""},{"$f":"IFERROR(INDEX($C$2:$C$1840,_xlfn.AGGREGATE(15,3,(($A$2:$A$1840=$N$3)/($A$2:$A$1840=$N$3)*ROW($A$2:$A$1840))-ROW($A$1), ROWS($M$3:M180))), \"\")","v":""},{"$f":"IFERROR(INDEX($B$2:$B$1840,_xlfn.AGGREGATE(15,3,(($A$2:$A$1840=$N$3)/($A$2:$A$1840=$N$3)*ROW($A$2:$A$1840))-ROW($A$1), ROWS($M$3:M180))), \"\")","v":""},{"$f":"IFERROR(INDEX($J$2:$J$1840,_xlfn.AGGREGATE(15,3,(($A$2:$A$1840=$N$3)/($A$2:$A$1840=$N$3)*ROW($A$2:$A$1840))-ROW($A$1), ROWS($M$3:M180))), \"\")","v":""},{"$f":"IFERROR(INDEX($G$2:$G$1840,_xlfn.AGGREGATE(15,3,(($A$2:$A$1840=$N$3)/($A$2:$A$1840=$N$3)*ROW($A$2:$A$1840))-ROW($A$1), ROWS($M$3:M180))), \"\")","v":""},""]
["0035","Samuel W Mason","00350304",null,"PK - 05","SW",210,null,"ES",156,219.20000000000002,null,null,null,{"$f":"IFERROR((RANK(T181,$T$3:$T$191,0)+COUNTIF($T$3:T181, T181)-1), \"\")","v":""},{"$f":"IFERROR(INDEX($C$2:$C$1840,_xlfn.AGGREGATE(15,3,(($A$2:$A$1840=$N$3)/($A$2:$A$1840=$N$3)*ROW($A$2:$A$1840))-ROW($A$1), ROWS($M$3:M181))), \"\")","v":""},{"$f":"IFERROR(INDEX($B$2:$B$1840,_xlfn.AGGREGATE(15,3,(($A$2:$A$1840=$N$3)/($A$2:$A$1840=$N$3)*ROW($A$2:$A$1840))-ROW($A$1), ROWS($M$3:M181))), \"\")","v":""},{"$f":"IFERROR(INDEX($J$2:$J$1840,_xlfn.AGGREGATE(15,3,(($A$2:$A$1840=$N$3)/($A$2:$A$1840=$N$3)*ROW($A$2:$A$1840))-ROW($A$1), ROWS($M$3:M181))), \"\")","v":""},{"$f":"IFERROR(INDEX($G$2:$G$1840,_xlfn.AGGREGATE(15,3,(($A$2:$A$1840=$N$3)/($A$2:$A$1840=$N$3)*ROW($A$2:$A$1840))-ROW($A$1), ROWS($M$3:M181))), \"\")","v":""},""]
["0035","Sarah Greenwood","00350308",null,"PK - 08","SW",388,null,"ESMS",330,473.6,null,null,null,{"$f":"IFERROR((RANK(T182,$T$3:$T$191,0)+COUNTIF($T$3:T182, T182)-1), \"\")","v":""},{"$f":"IFERROR(INDEX($C$2:$C$1840,_xlfn.AGGREGATE(15,3,(($A$2:$A$1840=$N$3)/($A$2:$A$1840=$N$3)*ROW($A$2:$A$1840))-ROW($A$1), ROWS($M$3:M182))), \"\")","v":""},{"$f":"IFERROR(INDEX($B$2:$B$1840,_xlfn.AGGREGATE(15,3,(($A$2:$A$1840=$N$3)/($A$2:$A$1840=$N$3)*ROW($A$2:$A$1840))-ROW($A$1), ROWS($M$3:M182))), \"\")","v":""},{"$f":"IFERROR(INDEX($J$2:$J$1840,_xlfn.AGGREGATE(15,3,(($A$2:$A$1840=$N$3)/($A$2:$A$1840=$N$3)*ROW($A$2:$A$1840))-ROW($A$1), ROWS($M$3:M182))), \"\")","v":""},{"$f":"IFERROR(INDEX($G$2:$G$1840,_xlfn.AGGREGATE(15,3,(($A$2:$A$1840=$N$3)/($A$2:$A$1840=$N$3)*ROW($A$2:$A$1840))-ROW($A$1), ROWS($M$3:M182))), \"\")","v":""},""]
["0035","Gardner Pilot Academy","00350326",null,"PK - 08","SW",376,null,"ESMS",252,377.6,null,null,null,{"$f":"IFERROR((RANK(T183,$T$3:$T$191,0)+COUNTIF($T$3:T183, T183)-1), \"\")","v":""},{"$f":"IFERROR(INDEX($C$2:$C$1840,_xlfn.AGGREGATE(15,3,(($A$2:$A$1840=$N$3)/($A$2:$A$1840=$N$3)*ROW($A$2:$A$1840))-ROW($A$1), ROWS($M$3:M183))), \"\")","v":""},{"$f":"IFERROR(INDEX($B$2:$B$1840,_xlfn.AGGREGATE(15,3,(($A$2:$A$1840=$N$3)/($A$2:$A$1840=$N$3)*ROW($A$2:$A$1840))-ROW($A$1), ROWS($M$3:M183))), \"\")","v":""},{"$f":"IFERROR(INDEX($J$2:$J$1840,_xlfn.AGGREGATE(15,3,(($A$2:$A$1840=$N$3)/($A$2:$A$1840=$N$3)*ROW($A$2:$A$1840))-ROW($A$1), ROWS($M$3:M183))), \"\")","v":""},{"$f":"IFERROR(INDEX($G$2:$G$1840,_xlfn.AGGREGATE(15,3,(($A$2:$A$1840=$N$3)/($A$2:$A$1840=$N$3)*ROW($A$2:$A$1840))-ROW($A$1), ROWS($M$3:M183))), \"\")","v":""},""]
["0035","Thomas J Kenny","00350328",null,"PK - 06","SW",339,null,"ES",208,313.60000000000002,null,null,null,{"$f":"IFERROR((RANK(T184,$T$3:$T$191,0)+COUNTIF($T$3:T184, T184)-1), \"\")","v":""},{"$f":"IFERROR(INDEX($C$2:$C$1840,_xlfn.AGGREGATE(15,3,(($A$2:$A$1840=$N$3)/($A$2:$A$1840=$N$3)*ROW($A$2:$A$1840))-ROW($A$1), ROWS($M$3:M184))), \"\")","v":""},{"$f":"IFERROR(INDEX($B$2:$B$1840,_xlfn.AGGREGATE(15,3,(($A$2:$A$1840=$N$3)/($A$2:$A$1840=$N$3)*ROW($A$2:$A$1840))-ROW($A$1), ROWS($M$3:M184))), \"\")","v":""},{"$f":"IFERROR(INDEX($J$2:$J$1840,_xlfn.AGGREGATE(15,3,(($A$2:$A$1840=$N$3)/($A$2:$A$1840=$N$3)*ROW($A$2:$A$1840))-ROW($A$1), ROWS($M$3:M184))), \"\")","v":""},{"$f":"IFERROR(INDEX($G$2:$G$1840,_xlfn.AGGREGATE(15,3,(($A$2:$A$1840=$N$3)/($A$2:$A$1840=$N$3)*ROW($A$2:$A$1840))-ROW($A$1), ROWS($M$3:M184))), \"\")","v":""},""]
["0035","Warren-Prescott","00350346",null,"PK - 08","SW",547,null,"ESMS",240,350.40000000000003,null,null,null,{"$f":"IFERROR((RANK(T185,$T$3:$T$191,0)+COUNTIF($T$3:T185, T185)-1), \"\")","v":""},{"$f":"IFERROR(INDEX($C$2:$C$1840,_xlfn.AGGREGATE(15,3,(($A$2:$A$1840=$N$3)/($A$2:$A$1840=$N$3)*ROW($A$2:$A$1840))-ROW($A$1), ROWS($M$3:M185))), \"\")","v":""},{"$f":"IFERROR(INDEX($B$2:$B$1840,_xlfn.AGGREGATE(15,3,(($A$2:$A$1840=$N$3)/($A$2:$A$1840=$N$3)*ROW($A$2:$A$1840))-ROW($A$1), ROWS($M$3:M185))), \"\")","v":""},{"$f":"IFERROR(INDEX($J$2:$J$1840,_xlfn.AGGREGATE(15,3,(($A$2:$A$1840=$N$3)/($A$2:$A$1840=$N$3)*ROW($A$2:$A$1840))-ROW($A$1), ROWS($M$3:M185))), \"\")","v":""},{"$f":"IFERROR(INDEX($G$2:$G$1840,_xlfn.AGGREGATE(15,3,(($A$2:$A$1840=$N$3)/($A$2:$A$1840=$N$3)*ROW($A$2:$A$1840))-ROW($A$1), ROWS($M$3:M185))), \"\")","v":""},""]
["0035","William Ellery Channing","00350360",null,"PK - 06","SW",215,null,"ES",146,211.20000000000002,null,null,null,{"$f":"IFERROR((RANK(T186,$T$3:$T$191,0)+COUNTIF($T$3:T186, T186)-1), \"\")","v":""},{"$f":"IFERROR(INDEX($C$2:$C$1840,_xlfn.AGGREGATE(15,3,(($A$2:$A$1840=$N$3)/($A$2:$A$1840=$N$3)*ROW($A$2:$A$1840))-ROW($A$1), ROWS($M$3:M186))), \"\")","v":""},{"$f":"IFERROR(INDEX($B$2:$B$1840,_xlfn.AGGREGATE(15,3,(($A$2:$A$1840=$N$3)/($A$2:$A$1840=$N$3)*ROW($A$2:$A$1840))-ROW($A$1), ROWS($M$3:M186))), \"\")","v":""},{"$f":"IFERROR(INDEX($J$2:$J$1840,_xlfn.AGGREGATE(15,3,(($A$2:$A$1840=$N$3)/($A$2:$A$1840=$N$3)*ROW($A$2:$A$1840))-ROW($A$1), ROWS($M$3:M186))), \"\")","v":""},{"$f":"IFERROR(INDEX($G$2:$G$1840,_xlfn.AGGREGATE(15,3,(($A$2:$A$1840=$N$3)/($A$2:$A$1840=$N$3)*ROW($A$2:$A$1840))-ROW($A$1), ROWS($M$3:M186))), \"\")","v":""},""]
["0035","William McKinley","00350363",null,"01 - 12","SW",278,null,"MSHS/K-12",243,358.40000000000003,null,null,null,{"$f":"IFERROR((RANK(T187,$T$3:$T$191,0)+COUNTIF($T$3:T187, T187)-1), \"\")","v":""},{"$f":"IFERROR(INDEX($C$2:$C$1840,_xlfn.AGGREGATE(15,3,(($A$2:$A$1840=$N$3)/($A$2:$A$1840=$N$3)*ROW($A$2:$A$1840))-ROW($A$1), ROWS($M$3:M187))), \"\")","v":""},{"$f":"IFERROR(INDEX($B$2:$B$1840,_xlfn.AGGREGATE(15,3,(($A$2:$A$1840=$N$3)/($A$2:$A$1840=$N$3)*ROW($A$2:$A$1840))-ROW($A$1), ROWS($M$3:M187))), \"\")","v":""},{"$f":"IFERROR(INDEX($J$2:$J$1840,_xlfn.AGGREGATE(15,3,(($A$2:$A$1840=$N$3)/($A$2:$A$1840=$N$3)*ROW($A$2:$A$1840))-ROW($A$1), ROWS($M$3:M187))), \"\")","v":""},{"$f":"IFERROR(INDEX($G$2:$G$1840,_xlfn.AGGREGATE(15,3,(($A$2:$A$1840=$N$3)/($A$2:$A$1840=$N$3)*ROW($A$2:$A$1840))-ROW($A$1), ROWS($M$3:M187))), \"\")","v":""},""]
["0035","William E Russell","00350366",null,"PK - 05","SW",368,null,"ES",262,361.6,null,null,null,{"$f":"IFERROR((RANK(T188,$T$3:$T$191,0)+COUNTIF($T$3:T188, T188)-1), \"\")","v":""},{"$f":"IFERROR(INDEX($C$2:$C$1840,_xlfn.AGGREGATE(15,3,(($A$2:$A$1840=$N$3)/($A$2:$A$1840=$N$3)*ROW($A$2:$A$1840))-ROW($A$1), ROWS($M$3:M188))), \"\")","v":""},{"$f":"IFERROR(INDEX($B$2:$B$1840,_xlfn.AGGREGATE(15,3,(($A$2:$A$1840=$N$3)/($A$2:$A$1840=$N$3)*ROW($A$2:$A$1840))-ROW($A$1), ROWS($M$3:M188))), \"\")","v":""},{"$f":"IFERROR(INDEX($J$2:$J$1840,_xlfn.AGGREGATE(15,3,(($A$2:$A$1840=$N$3)/($A$2:$A$1840=$N$3)*ROW($A$2:$A$1840))-ROW($A$1), ROWS($M$3:M188))), \"\")","v":""},{"$f":"IFERROR(INDEX($G$2:$G$1840,_xlfn.AGGREGATE(15,3,(($A$2:$A$1840=$N$3)/($A$2:$A$1840=$N$3)*ROW($A$2:$A$1840))-ROW($A$1), ROWS($M$3:M188))), \"\")","v":""},""]
["0035","William Monroe Trotter","00350370",null,"PK - 08","SW",396,null,"ESMS",318,452.8,null,null,null,{"$f":"IFERROR((RANK(T189,$T$3:$T$191,0)+COUNTIF($T$3:T189, T189)-1), \"\")","v":""},{"$f":"IFERROR(INDEX($C$2:$C$1840,_xlfn.AGGREGATE(15,3,(($A$2:$A$1840=$N$3)/($A$2:$A$1840=$N$3)*ROW($A$2:$A$1840))-ROW($A$1), ROWS($M$3:M189))), \"\")","v":""},{"$f":"IFERROR(INDEX($B$2:$B$1840,_xlfn.AGGREGATE(15,3,(($A$2:$A$1840=$N$3)/($A$2:$A$1840=$N$3)*ROW($A$2:$A$1840))-ROW($A$1), ROWS($M$3:M189))), \"\")","v":""},{"$f":"IFERROR(INDEX($J$2:$J$1840,_xlfn.AGGREGATE(15,3,(($A$2:$A$1840=$N$3)/($A$2:$A$1840=$N$3)*ROW($A$2:$A$1840))-ROW($A$1), ROWS($M$3:M189))), \"\")","v":""},{"$f":"IFERROR(INDEX($G$2:$G$1840,_xlfn.AGGREGATE(15,3,(($A$2:$A$1840=$N$3)/($A$2:$A$1840=$N$3)*ROW($A$2:$A$1840))-ROW($A$1), ROWS($M$3:M189))), \"\")","v":""},""]
["0035","Winship Elementary","00350374",null,"PK - 05","SW",222,null,"ES",120,161.60000000000002,null,null,null,{"$f":"IFERROR((RANK(T190,$T$3:$T$191,0)+COUNTIF($T$3:T190, T190)-1), \"\")","v":""},{"$f":"IFERROR(INDEX($C$2:$C$1840,_xlfn.AGGREGATE(15,3,(($A$2:$A$1840=$N$3)/($A$2:$A$1840=$N$3)*ROW($A$2:$A$1840))-ROW($A$1), ROWS($M$3:M190))), \"\")","v":""},{"$f":"IFERROR(INDEX($B$2:$B$1840,_xlfn.AGGREGATE(15,3,(($A$2:$A$1840=$N$3)/($A$2:$A$1840=$N$3)*ROW($A$2:$A$1840))-ROW($A$1), ROWS($M$3:M190))), \"\")","v":""},{"$f":"IFERROR(INDEX($J$2:$J$1840,_xlfn.AGGREGATE(15,3,(($A$2:$A$1840=$N$3)/($A$2:$A$1840=$N$3)*ROW($A$2:$A$1840))-ROW($A$1), ROWS($M$3:M190))), \"\")","v":""},{"$f":"IFERROR(INDEX($G$2:$G$1840,_xlfn.AGGREGATE(15,3,(($A$2:$A$1840=$N$3)/($A$2:$A$1840=$N$3)*ROW($A$2:$A$1840))-ROW($A$1), ROWS($M$3:M190))), \"\")","v":""},""]
["0035","Edison K-8","00350375",null,"PK - 08","SW",517,null,"ESMS",388,598.4,null,null,null,{"$f":"IFERROR((RANK(T191,$T$3:$T$191,0)+COUNTIF($T$3:T191, T191)-1), \"\")","v":""},{"$f":"IFERROR(INDEX($C$2:$C$1840,_xlfn.AGGREGATE(15,3,(($A$2:$A$1840=$N$3)/($A$2:$A$1840=$N$3)*ROW($A$2:$A$1840))-ROW($A$1), ROWS($M$3:M191))), \"\")","v":""},{"$f":"IFERROR(INDEX($B$2:$B$1840,_xlfn.AGGREGATE(15,3,(($A$2:$A$1840=$N$3)/($A$2:$A$1840=$N$3)*ROW($A$2:$A$1840))-ROW($A$1), ROWS($M$3:M191))), \"\")","v":""},{"$f":"IFERROR(INDEX($J$2:$J$1840,_xlfn.AGGREGATE(15,3,(($A$2:$A$1840=$N$3)/($A$2:$A$1840=$N$3)*ROW($A$2:$A$1840))-ROW($A$1), ROWS($M$3:M191))), \"\")","v":""},{"$f":"IFERROR(INDEX($G$2:$G$1840,_xlfn.AGGREGATE(15,3,(($A$2:$A$1840=$N$3)/($A$2:$A$1840=$N$3)*ROW($A$2:$A$1840))-ROW($A$1), ROWS($M$3:M191))), \"\")","v":""},""]
["0035","King K-8","00350376",null,"PK - 08","SW",574,null,"ESMS",490,688,null,null,null,{"$f":"IFERROR((RANK(T192,$T$3:$T$191,0)+COUNTIF($T$3:T192, T192)-1), \"\")","v":""},{"$f":"IFERROR(INDEX($C$2:$C$1840,_xlfn.AGGREGATE(15,3,(($A$2:$A$1840=$N$3)/($A$2:$A$1840=$N$3)*ROW($A$2:$A$1840))-ROW($A$1), ROWS($M$3:M192))), \"\")","v":""},{"$f":"IFERROR(INDEX($B$2:$B$1840,_xlfn.AGGREGATE(15,3,(($A$2:$A$1840=$N$3)/($A$2:$A$1840=$N$3)*ROW($A$2:$A$1840))-ROW($A$1), ROWS($M$3:M192))), \"\")","v":""},{"$f":"IFERROR(INDEX($J$2:$J$1840,_xlfn.AGGREGATE(15,3,(($A$2:$A$1840=$N$3)/($A$2:$A$1840=$N$3)*ROW($A$2:$A$1840))-ROW($A$1), ROWS($M$3:M192))), \"\")","v":""},{"$f":"IFERROR(INDEX($G$2:$G$1840,_xlfn.AGGREGATE(15,3,(($A$2:$A$1840=$N$3)/($A$2:$A$1840=$N$3)*ROW($A$2:$A$1840))-ROW($A$1), ROWS($M$3:M192))), \"\")","v":""},""]
["0035","Higginson/Lewis K-8","00350377",null,"03 - 08","SW",218,null,"ESMS",200,320,null,null,null,{"$f":"IFERROR((RANK(T193,$T$3:$T$191,0)+COUNTIF($T$3:T193, T193)-1), \"\")","v":""},{"$f":"IFERROR(INDEX($C$2:$C$1840,_xlfn.AGGREGATE(15,3,(($A$2:$A$1840=$N$3)/($A$2:$A$1840=$N$3)*ROW($A$2:$A$1840))-ROW($A$1), ROWS($M$3:M193))), \"\")","v":""},{"$f":"IFERROR(INDEX($B$2:$B$1840,_xlfn.AGGREGATE(15,3,(($A$2:$A$1840=$N$3)/($A$2:$A$1840=$N$3)*ROW($A$2:$A$1840))-ROW($A$1), ROWS($M$3:M193))), \"\")","v":""},{"$f":"IFERROR(INDEX($J$2:$J$1840,_xlfn.AGGREGATE(15,3,(($A$2:$A$1840=$N$3)/($A$2:$A$1840=$N$3)*ROW($A$2:$A$1840))-ROW($A$1), ROWS($M$3:M193))), \"\")","v":""},{"$f":"IFERROR(INDEX($G$2:$G$1840,_xlfn.AGGREGATE(15,3,(($A$2:$A$1840=$N$3)/($A$2:$A$1840=$N$3)*ROW($A$2:$A$1840))-ROW($A$1), ROWS($M$3:M193))), \"\")","v":""},""]
["0035","Mildred Avenue K-8","00350378",null,"PK - 08","SW",668,null,"ESMS",510,772.80000000000007,null,null,null,{"$f":"IFERROR((RANK(T194,$T$3:$T$191,0)+COUNTIF($T$3:T194, T194)-1), \"\")","v":""},{"$f":"IFERROR(INDEX($C$2:$C$1840,_xlfn.AGGREGATE(15,3,(($A$2:$A$1840=$N$3)/($A$2:$A$1840=$N$3)*ROW($A$2:$A$1840))-ROW($A$1), ROWS($M$3:M194))), \"\")","v":""},{"$f":"IFERROR(INDEX($B$2:$B$1840,_xlfn.AGGREGATE(15,3,(($A$2:$A$1840=$N$3)/($A$2:$A$1840=$N$3)*ROW($A$2:$A$1840))-ROW($A$1), ROWS($M$3:M194))), \"\")","v":""},{"$f":"IFERROR(INDEX($J$2:$J$1840,_xlfn.AGGREGATE(15,3,(($A$2:$A$1840=$N$3)/($A$2:$A$1840=$N$3)*ROW($A$2:$A$1840))-ROW($A$1), ROWS($M$3:M194))), \"\")","v":""},{"$f":"IFERROR(INDEX($G$2:$G$1840,_xlfn.AGGREGATE(15,3,(($A$2:$A$1840=$N$3)/($A$2:$A$1840=$N$3)*ROW($A$2:$A$1840))-ROW($A$1), ROWS($M$3:M194))), \"\")","v":""},""]
["0035","Young Achievers","00350380",null,"PK - 08","SW",573,null,"ESMS",478,705.6,null,null,null,{"$f":"IFERROR((RANK(T195,$T$3:$T$191,0)+COUNTIF($T$3:T195, T195)-1), \"\")","v":""},{"$f":"IFERROR(INDEX($C$2:$C$1840,_xlfn.AGGREGATE(15,3,(($A$2:$A$1840=$N$3)/($A$2:$A$1840=$N$3)*ROW($A$2:$A$1840))-ROW($A$1), ROWS($M$3:M195))), \"\")","v":""},{"$f":"IFERROR(INDEX($B$2:$B$1840,_xlfn.AGGREGATE(15,3,(($A$2:$A$1840=$N$3)/($A$2:$A$1840=$N$3)*ROW($A$2:$A$1840))-ROW($A$1), ROWS($M$3:M195))), \"\")","v":""},{"$f":"IFERROR(INDEX($J$2:$J$1840,_xlfn.AGGREGATE(15,3,(($A$2:$A$1840=$N$3)/($A$2:$A$1840=$N$3)*ROW($A$2:$A$1840))-ROW($A$1), ROWS($M$3:M195))), \"\")","v":""},{"$f":"IFERROR(INDEX($G$2:$G$1840,_xlfn.AGGREGATE(15,3,(($A$2:$A$1840=$N$3)/($A$2:$A$1840=$N$3)*ROW($A$2:$A$1840))-ROW($A$1), ROWS($M$3:M195))), \"\")","v":""},{"$f":"IFERROR(R195/S195, \"\")","v":""}]
["0035","Mission Hill School","00350382",null,"PK - 08","SW",234,null,"ESMS",113,163.20000000000002,null,null,null,{"$f":"IFERROR((RANK(T196,$T$3:$T$191,0)+COUNTIF($T$3:T196, T196)-1), \"\")","v":""},{"$f":"IFERROR(INDEX($C$2:$C$1840,_xlfn.AGGREGATE(15,3,(($A$2:$A$1840=$N$3)/($A$2:$A$1840=$N$3)*ROW($A$2:$A$1840))-ROW($A$1), ROWS($M$3:M196))), \"\")","v":""},{"$f":"IFERROR(INDEX($B$2:$B$1840,_xlfn.AGGREGATE(15,3,(($A$2:$A$1840=$N$3)/($A$2:$A$1840=$N$3)*ROW($A$2:$A$1840))-ROW($A$1), ROWS($M$3:M196))), \"\")","v":""},{"$f":"IFERROR(INDEX($J$2:$J$1840,_xlfn.AGGREGATE(15,3,(($A$2:$A$1840=$N$3)/($A$2:$A$1840=$N$3)*ROW($A$2:$A$1840))-ROW($A$1), ROWS($M$3:M196))), \"\")","v":""},{"$f":"IFERROR(INDEX($G$2:$G$1840,_xlfn.AGGREGATE(15,3,(($A$2:$A$1840=$N$3)/($A$2:$A$1840=$N$3)*ROW($A$2:$A$1840))-ROW($A$1), ROWS($M$3:M196))), \"\")","v":""},""]
["0035","Lilla G. Frederick Middle School","00350383",null,"06 - 08","SW",390,null,"MS",338,540.80000000000007,null,null,null,{"$f":"IFERROR((RANK(T197,$T$3:$T$191,0)+COUNTIF($T$3:T197, T197)-1), \"\")","v":""},{"$f":"IFERROR(INDEX($C$2:$C$1840,_xlfn.AGGREGATE(15,3,(($A$2:$A$1840=$N$3)/($A$2:$A$1840=$N$3)*ROW($A$2:$A$1840))-ROW($A$1), ROWS($M$3:M197))), \"\")","v":""},{"$f":"IFERROR(INDEX($B$2:$B$1840,_xlfn.AGGREGATE(15,3,(($A$2:$A$1840=$N$3)/($A$2:$A$1840=$N$3)*ROW($A$2:$A$1840))-ROW($A$1), ROWS($M$3:M197))), \"\")","v":""},{"$f":"IFERROR(INDEX($J$2:$J$1840,_xlfn.AGGREGATE(15,3,(($A$2:$A$1840=$N$3)/($A$2:$A$1840=$N$3)*ROW($A$2:$A$1840))-ROW($A$1), ROWS($M$3:M197))), \"\")","v":""},{"$f":"IFERROR(INDEX($G$2:$G$1840,_xlfn.AGGREGATE(15,3,(($A$2:$A$1840=$N$3)/($A$2:$A$1840=$N$3)*ROW($A$2:$A$1840))-ROW($A$1), ROWS($M$3:M197))), \"\")","v":""},""]
["0035","Blackstone","00350390",null,"PK - 05","SW",524,null,"ES",423,604.80000000000007,null,null,null,{"$f":"IFERROR((RANK(T198,$T$3:$T$191,0)+COUNTIF($T$3:T198, T198)-1), \"\")","v":""},{"$f":"IFERROR(INDEX($C$2:$C$1840,_xlfn.AGGREGATE(15,3,(($A$2:$A$1840=$N$3)/($A$2:$A$1840=$N$3)*ROW($A$2:$A$1840))-ROW($A$1), ROWS($M$3:M198))), \"\")","v":""},{"$f":"IFERROR(INDEX($B$2:$B$1840,_xlfn.AGGREGATE(15,3,(($A$2:$A$1840=$N$3)/($A$2:$A$1840=$N$3)*ROW($A$2:$A$1840))-ROW($A$1), ROWS($M$3:M198))), \"\")","v":""},{"$f":"IFERROR(INDEX($J$2:$J$1840,_xlfn.AGGREGATE(15,3,(($A$2:$A$1840=$N$3)/($A$2:$A$1840=$N$3)*ROW($A$2:$A$1840))-ROW($A$1), ROWS($M$3:M198))), \"\")","v":""},{"$f":"IFERROR(INDEX($G$2:$G$1840,_xlfn.AGGREGATE(15,3,(($A$2:$A$1840=$N$3)/($A$2:$A$1840=$N$3)*ROW($A$2:$A$1840))-ROW($A$1), ROWS($M$3:M198))), \"\")","v":""},""]
["0035","Dr. William Henderson Upper","00350426",null,"02 - 12","SW",738,null,"MSHS/K-12",463,726.40000000000009,null,null,null,{"$f":"IFERROR((RANK(T199,$T$3:$T$191,0)+COUNTIF($T$3:T199, T199)-1), \"\")","v":""},{"$f":"IFERROR(INDEX($C$2:$C$1840,_xlfn.AGGREGATE(15,3,(($A$2:$A$1840=$N$3)/($A$2:$A$1840=$N$3)*ROW($A$2:$A$1840))-ROW($A$1), ROWS($M$3:M199))), \"\")","v":""},{"$f":"IFERROR(INDEX($B$2:$B$1840,_xlfn.AGGREGATE(15,3,(($A$2:$A$1840=$N$3)/($A$2:$A$1840=$N$3)*ROW($A$2:$A$1840))-ROW($A$1), ROWS($M$3:M199))), \"\")","v":""},{"$f":"IFERROR(INDEX($J$2:$J$1840,_xlfn.AGGREGATE(15,3,(($A$2:$A$1840=$N$3)/($A$2:$A$1840=$N$3)*ROW($A$2:$A$1840))-ROW($A$1), ROWS($M$3:M199))), \"\")","v":""},{"$f":"IFERROR(INDEX($G$2:$G$1840,_xlfn.AGGREGATE(15,3,(($A$2:$A$1840=$N$3)/($A$2:$A$1840=$N$3)*ROW($A$2:$A$1840))-ROW($A$1), ROWS($M$3:M199))), \"\")","v":""},""]
["0035","Clarence R Edwards Middle","00350430",null,"07 - 08","SW",206,null,"MS",159,254.4,null,null,null,{"$f":"IFERROR((RANK(T200,$T$3:$T$191,0)+COUNTIF($T$3:T200, T200)-1), \"\")","v":""},{"$f":"IFERROR(INDEX($C$2:$C$1840,_xlfn.AGGREGATE(15,3,(($A$2:$A$1840=$N$3)/($A$2:$A$1840=$N$3)*ROW($A$2:$A$1840))-ROW($A$1), ROWS($M$3:M200))), \"\")","v":""},{"$f":"IFERROR(INDEX($B$2:$B$1840,_xlfn.AGGREGATE(15,3,(($A$2:$A$1840=$N$3)/($A$2:$A$1840=$N$3)*ROW($A$2:$A$1840))-ROW($A$1), ROWS($M$3:M200))), \"\")","v":""},{"$f":"IFERROR(INDEX($J$2:$J$1840,_xlfn.AGGREGATE(15,3,(($A$2:$A$1840=$N$3)/($A$2:$A$1840=$N$3)*ROW($A$2:$A$1840))-ROW($A$1), ROWS($M$3:M200))), \"\")","v":""},{"$f":"IFERROR(INDEX($G$2:$G$1840,_xlfn.AGGREGATE(15,3,(($A$2:$A$1840=$N$3)/($A$2:$A$1840=$N$3)*ROW($A$2:$A$1840))-ROW($A$1), ROWS($M$3:M200))), \"\")","v":""},""]
["0035","Washington Irving Middle","00350445",null,"06 - 08","SW",191,null,"MS",143,228.8,null,null,null,{"$f":"IFERROR((RANK(T201,$T$3:$T$191,0)+COUNTIF($T$3:T201, T201)-1), \"\")","v":""},{"$f":"IFERROR(INDEX($C$2:$C$1840,_xlfn.AGGREGATE(15,3,(($A$2:$A$1840=$N$3)/($A$2:$A$1840=$N$3)*ROW($A$2:$A$1840))-ROW($A$1), ROWS($M$3:M201))), \"\")","v":""},{"$f":"IFERROR(INDEX($B$2:$B$1840,_xlfn.AGGREGATE(15,3,(($A$2:$A$1840=$N$3)/($A$2:$A$1840=$N$3)*ROW($A$2:$A$1840))-ROW($A$1), ROWS($M$3:M201))), \"\")","v":""},{"$f":"IFERROR(INDEX($J$2:$J$1840,_xlfn.AGGREGATE(15,3,(($A$2:$A$1840=$N$3)/($A$2:$A$1840=$N$3)*ROW($A$2:$A$1840))-ROW($A$1), ROWS($M$3:M201))), \"\")","v":""},{"$f":"IFERROR(INDEX($G$2:$G$1840,_xlfn.AGGREGATE(15,3,(($A$2:$A$1840=$N$3)/($A$2:$A$1840=$N$3)*ROW($A$2:$A$1840))-ROW($A$1), ROWS($M$3:M201))), \"\")","v":""},""]
["0035","James P Timilty Middle","00350485",null,"06 - 08","SW",241,null,"MS",204,326.40000000000003,null,null,null,{"$f":"IFERROR((RANK(T202,$T$3:$T$191,0)+COUNTIF($T$3:T202, T202)-1), \"\")","v":""},{"$f":"IFERROR(INDEX($C$2:$C$1840,_xlfn.AGGREGATE(15,3,(($A$2:$A$1840=$N$3)/($A$2:$A$1840=$N$3)*ROW($A$2:$A$1840))-ROW($A$1), ROWS($M$3:M202))), \"\")","v":""},{"$f":"IFERROR(INDEX($B$2:$B$1840,_xlfn.AGGREGATE(15,3,(($A$2:$A$1840=$N$3)/($A$2:$A$1840=$N$3)*ROW($A$2:$A$1840))-ROW($A$1), ROWS($M$3:M202))), \"\")","v":""},{"$f":"IFERROR(INDEX($J$2:$J$1840,_xlfn.AGGREGATE(15,3,(($A$2:$A$1840=$N$3)/($A$2:$A$1840=$N$3)*ROW($A$2:$A$1840))-ROW($A$1), ROWS($M$3:M202))), \"\")","v":""},{"$f":"IFERROR(INDEX($G$2:$G$1840,_xlfn.AGGREGATE(15,3,(($A$2:$A$1840=$N$3)/($A$2:$A$1840=$N$3)*ROW($A$2:$A$1840))-ROW($A$1), ROWS($M$3:M202))), \"\")","v":""},""]
["0035","Brighton High","00350505",null,"09 - 12","SW",407,null,"HS",316,491.20000000000005,null,null,null,{"$f":"IFERROR((RANK(T203,$T$3:$T$191,0)+COUNTIF($T$3:T203, T203)-1), \"\")","v":""},{"$f":"IFERROR(INDEX($C$2:$C$1840,_xlfn.AGGREGATE(15,3,(($A$2:$A$1840=$N$3)/($A$2:$A$1840=$N$3)*ROW($A$2:$A$1840))-ROW($A$1), ROWS($M$3:M203))), \"\")","v":""},{"$f":"IFERROR(INDEX($B$2:$B$1840,_xlfn.AGGREGATE(15,3,(($A$2:$A$1840=$N$3)/($A$2:$A$1840=$N$3)*ROW($A$2:$A$1840))-ROW($A$1), ROWS($M$3:M203))), \"\")","v":""},{"$f":"IFERROR(INDEX($J$2:$J$1840,_xlfn.AGGREGATE(15,3,(($A$2:$A$1840=$N$3)/($A$2:$A$1840=$N$3)*ROW($A$2:$A$1840))-ROW($A$1), ROWS($M$3:M203))), \"\")","v":""},{"$f":"IFERROR(INDEX($G$2:$G$1840,_xlfn.AGGREGATE(15,3,(($A$2:$A$1840=$N$3)/($A$2:$A$1840=$N$3)*ROW($A$2:$A$1840))-ROW($A$1), ROWS($M$3:M203))), \"\")","v":""},""]
["0035","Boston International High School","00350507",null,"09 - 12","SW",409,null,"HS",309,494.40000000000003,null,null,null,{"$f":"IFERROR((RANK(T204,$T$3:$T$191,0)+COUNTIF($T$3:T204, T204)-1), \"\")","v":""},{"$f":"IFERROR(INDEX($C$2:$C$1840,_xlfn.AGGREGATE(15,3,(($A$2:$A$1840=$N$3)/($A$2:$A$1840=$N$3)*ROW($A$2:$A$1840))-ROW($A$1), ROWS($M$3:M204))), \"\")","v":""},{"$f":"IFERROR(INDEX($B$2:$B$1840,_xlfn.AGGREGATE(15,3,(($A$2:$A$1840=$N$3)/($A$2:$A$1840=$N$3)*ROW($A$2:$A$1840))-ROW($A$1), ROWS($M$3:M204))), \"\")","v":""},{"$f":"IFERROR(INDEX($J$2:$J$1840,_xlfn.AGGREGATE(15,3,(($A$2:$A$1840=$N$3)/($A$2:$A$1840=$N$3)*ROW($A$2:$A$1840))-ROW($A$1), ROWS($M$3:M204))), \"\")","v":""},{"$f":"IFERROR(INDEX($G$2:$G$1840,_xlfn.AGGREGATE(15,3,(($A$2:$A$1840=$N$3)/($A$2:$A$1840=$N$3)*ROW($A$2:$A$1840))-ROW($A$1), ROWS($M$3:M204))), \"\")","v":""},""]
["0035","Charlestown High","00350515",null,"09 - 12","SW",762,null,"HS",569,849.6,null,null,null,{"$f":"IFERROR((RANK(T205,$T$3:$T$191,0)+COUNTIF($T$3:T205, T205)-1), \"\")","v":""},{"$f":"IFERROR(INDEX($C$2:$C$1840,_xlfn.AGGREGATE(15,3,(($A$2:$A$1840=$N$3)/($A$2:$A$1840=$N$3)*ROW($A$2:$A$1840))-ROW($A$1), ROWS($M$3:M205))), \"\")","v":""},{"$f":"IFERROR(INDEX($B$2:$B$1840,_xlfn.AGGREGATE(15,3,(($A$2:$A$1840=$N$3)/($A$2:$A$1840=$N$3)*ROW($A$2:$A$1840))-ROW($A$1), ROWS($M$3:M205))), \"\")","v":""},{"$f":"IFERROR(INDEX($J$2:$J$1840,_xlfn.AGGREGATE(15,3,(($A$2:$A$1840=$N$3)/($A$2:$A$1840=$N$3)*ROW($A$2:$A$1840))-ROW($A$1), ROWS($M$3:M205))), \"\")","v":""},{"$f":"IFERROR(INDEX($G$2:$G$1840,_xlfn.AGGREGATE(15,3,(($A$2:$A$1840=$N$3)/($A$2:$A$1840=$N$3)*ROW($A$2:$A$1840))-ROW($A$1), ROWS($M$3:M205))), \"\")","v":""},""]
["0035","Community Academy","00350518",null,"09 - 12","SW",54,null,"HS",50,80,null,null,null,{"$f":"IFERROR((RANK(T206,$T$3:$T$191,0)+COUNTIF($T$3:T206, T206)-1), \"\")","v":""},{"$f":"IFERROR(INDEX($C$2:$C$1840,_xlfn.AGGREGATE(15,3,(($A$2:$A$1840=$N$3)/($A$2:$A$1840=$N$3)*ROW($A$2:$A$1840))-ROW($A$1), ROWS($M$3:M206))), \"\")","v":""},{"$f":"IFERROR(INDEX($B$2:$B$1840,_xlfn.AGGREGATE(15,3,(($A$2:$A$1840=$N$3)/($A$2:$A$1840=$N$3)*ROW($A$2:$A$1840))-ROW($A$1), ROWS($M$3:M206))), \"\")","v":""},{"$f":"IFERROR(INDEX($J$2:$J$1840,_xlfn.AGGREGATE(15,3,(($A$2:$A$1840=$N$3)/($A$2:$A$1840=$N$3)*ROW($A$2:$A$1840))-ROW($A$1), ROWS($M$3:M206))), \"\")","v":""},{"$f":"IFERROR(INDEX($G$2:$G$1840,_xlfn.AGGREGATE(15,3,(($A$2:$A$1840=$N$3)/($A$2:$A$1840=$N$3)*ROW($A$2:$A$1840))-ROW($A$1), ROWS($M$3:M206))), \"\")","v":""},""]
["0035","Excel High School","00350522",null,"09 - 12","SW",470,null,"HS",351,556.80000000000007,null,null,null,{"$f":"IFERROR((RANK(T207,$T$3:$T$191,0)+COUNTIF($T$3:T207, T207)-1), \"\")","v":""},{"$f":"IFERROR(INDEX($C$2:$C$1840,_xlfn.AGGREGATE(15,3,(($A$2:$A$1840=$N$3)/($A$2:$A$1840=$N$3)*ROW($A$2:$A$1840))-ROW($A$1), ROWS($M$3:M207))), \"\")","v":""},{"$f":"IFERROR(INDEX($B$2:$B$1840,_xlfn.AGGREGATE(15,3,(($A$2:$A$1840=$N$3)/($A$2:$A$1840=$N$3)*ROW($A$2:$A$1840))-ROW($A$1), ROWS($M$3:M207))), \"\")","v":""},{"$f":"IFERROR(INDEX($J$2:$J$1840,_xlfn.AGGREGATE(15,3,(($A$2:$A$1840=$N$3)/($A$2:$A$1840=$N$3)*ROW($A$2:$A$1840))-ROW($A$1), ROWS($M$3:M207))), \"\")","v":""},{"$f":"IFERROR(INDEX($G$2:$G$1840,_xlfn.AGGREGATE(15,3,(($A$2:$A$1840=$N$3)/($A$2:$A$1840=$N$3)*ROW($A$2:$A$1840))-ROW($A$1), ROWS($M$3:M207))), \"\")","v":""},""]
["0035","Jeremiah E Burke High","00350525",null,"09 - 12","SW",385,null,"HS",292,462.40000000000003,null,null,null,{"$f":"IFERROR((RANK(T208,$T$3:$T$191,0)+COUNTIF($T$3:T208, T208)-1), \"\")","v":""},{"$f":"IFERROR(INDEX($C$2:$C$1840,_xlfn.AGGREGATE(15,3,(($A$2:$A$1840=$N$3)/($A$2:$A$1840=$N$3)*ROW($A$2:$A$1840))-ROW($A$1), ROWS($M$3:M208))), \"\")","v":""},{"$f":"IFERROR(INDEX($B$2:$B$1840,_xlfn.AGGREGATE(15,3,(($A$2:$A$1840=$N$3)/($A$2:$A$1840=$N$3)*ROW($A$2:$A$1840))-ROW($A$1), ROWS($M$3:M208))), \"\")","v":""},{"$f":"IFERROR(INDEX($J$2:$J$1840,_xlfn.AGGREGATE(15,3,(($A$2:$A$1840=$N$3)/($A$2:$A$1840=$N$3)*ROW($A$2:$A$1840))-ROW($A$1), ROWS($M$3:M208))), \"\")","v":""},{"$f":"IFERROR(INDEX($G$2:$G$1840,_xlfn.AGGREGATE(15,3,(($A$2:$A$1840=$N$3)/($A$2:$A$1840=$N$3)*ROW($A$2:$A$1840))-ROW($A$1), ROWS($M$3:M208))), \"\")","v":""},""]
["0035","East Boston High","00350530",null,"09 - 12","SW",1047,null,"HS",730,1148.8,null,null,null,{"$f":"IFERROR((RANK(T209,$T$3:$T$191,0)+COUNTIF($T$3:T209, T209)-1), \"\")","v":""},{"$f":"IFERROR(INDEX($C$2:$C$1840,_xlfn.AGGREGATE(15,3,(($A$2:$A$1840=$N$3)/($A$2:$A$1840=$N$3)*ROW($A$2:$A$1840))-ROW($A$1), ROWS($M$3:M209))), \"\")","v":""},{"$f":"IFERROR(INDEX($B$2:$B$1840,_xlfn.AGGREGATE(15,3,(($A$2:$A$1840=$N$3)/($A$2:$A$1840=$N$3)*ROW($A$2:$A$1840))-ROW($A$1), ROWS($M$3:M209))), \"\")","v":""},{"$f":"IFERROR(INDEX($J$2:$J$1840,_xlfn.AGGREGATE(15,3,(($A$2:$A$1840=$N$3)/($A$2:$A$1840=$N$3)*ROW($A$2:$A$1840))-ROW($A$1), ROWS($M$3:M209))), \"\")","v":""},{"$f":"IFERROR(INDEX($G$2:$G$1840,_xlfn.AGGREGATE(15,3,(($A$2:$A$1840=$N$3)/($A$2:$A$1840=$N$3)*ROW($A$2:$A$1840))-ROW($A$1), ROWS($M$3:M209))), \"\")","v":""},""]
["0035","The English High","00350535",null,"09 - 12","SW",526,null,"HS",388,608,null,null,null,{"$f":"IFERROR((RANK(T210,$T$3:$T$191,0)+COUNTIF($T$3:T210, T210)-1), \"\")","v":""},{"$f":"IFERROR(INDEX($C$2:$C$1840,_xlfn.AGGREGATE(15,3,(($A$2:$A$1840=$N$3)/($A$2:$A$1840=$N$3)*ROW($A$2:$A$1840))-ROW($A$1), ROWS($M$3:M210))), \"\")","v":""},{"$f":"IFERROR(INDEX($B$2:$B$1840,_xlfn.AGGREGATE(15,3,(($A$2:$A$1840=$N$3)/($A$2:$A$1840=$N$3)*ROW($A$2:$A$1840))-ROW($A$1), ROWS($M$3:M210))), \"\")","v":""},{"$f":"IFERROR(INDEX($J$2:$J$1840,_xlfn.AGGREGATE(15,3,(($A$2:$A$1840=$N$3)/($A$2:$A$1840=$N$3)*ROW($A$2:$A$1840))-ROW($A$1), ROWS($M$3:M210))), \"\")","v":""},{"$f":"IFERROR(INDEX($G$2:$G$1840,_xlfn.AGGREGATE(15,3,(($A$2:$A$1840=$N$3)/($A$2:$A$1840=$N$3)*ROW($A$2:$A$1840))-ROW($A$1), ROWS($M$3:M210))), \"\")","v":""},""]
["0035","Madison Park High","00350537",null,"09 - 12","SW",1051,null,"HS",827,1299.2,null,null,null,{"$f":"IFERROR((RANK(T211,$T$3:$T$191,0)+COUNTIF($T$3:T211, T211)-1), \"\")","v":""},{"$f":"IFERROR(INDEX($C$2:$C$1840,_xlfn.AGGREGATE(15,3,(($A$2:$A$1840=$N$3)/($A$2:$A$1840=$N$3)*ROW($A$2:$A$1840))-ROW($A$1), ROWS($M$3:M211))), \"\")","v":""},{"$f":"IFERROR(INDEX($B$2:$B$1840,_xlfn.AGGREGATE(15,3,(($A$2:$A$1840=$N$3)/($A$2:$A$1840=$N$3)*ROW($A$2:$A$1840))-ROW($A$1), ROWS($M$3:M211))), \"\")","v":""},{"$f":"IFERROR(INDEX($J$2:$J$1840,_xlfn.AGGREGATE(15,3,(($A$2:$A$1840=$N$3)/($A$2:$A$1840=$N$3)*ROW($A$2:$A$1840))-ROW($A$1), ROWS($M$3:M211))), \"\")","v":""},{"$f":"IFERROR(INDEX($G$2:$G$1840,_xlfn.AGGREGATE(15,3,(($A$2:$A$1840=$N$3)/($A$2:$A$1840=$N$3)*ROW($A$2:$A$1840))-ROW($A$1), ROWS($M$3:M211))), \"\")","v":""},""]
["0035","Fenway High School","00350540",null,"09 - 12","SW",388,null,"HS",269,430.40000000000003,null,null,null,{"$f":"IFERROR((RANK(T212,$T$3:$T$191,0)+COUNTIF($T$3:T212, T212)-1), \"\")","v":""},{"$f":"IFERROR(INDEX($C$2:$C$1840,_xlfn.AGGREGATE(15,3,(($A$2:$A$1840=$N$3)/($A$2:$A$1840=$N$3)*ROW($A$2:$A$1840))-ROW($A$1), ROWS($M$3:M212))), \"\")","v":""},{"$f":"IFERROR(INDEX($B$2:$B$1840,_xlfn.AGGREGATE(15,3,(($A$2:$A$1840=$N$3)/($A$2:$A$1840=$N$3)*ROW($A$2:$A$1840))-ROW($A$1), ROWS($M$3:M212))), \"\")","v":""},{"$f":"IFERROR(INDEX($J$2:$J$1840,_xlfn.AGGREGATE(15,3,(($A$2:$A$1840=$N$3)/($A$2:$A$1840=$N$3)*ROW($A$2:$A$1840))-ROW($A$1), ROWS($M$3:M212))), \"\")","v":""},{"$f":"IFERROR(INDEX($G$2:$G$1840,_xlfn.AGGREGATE(15,3,(($A$2:$A$1840=$N$3)/($A$2:$A$1840=$N$3)*ROW($A$2:$A$1840))-ROW($A$1), ROWS($M$3:M212))), \"\")","v":""},""]
["0035","Another Course To College","00350541",null,"09 - 12","SW",243,null,"HS",172,275.2,null,null,null,{"$f":"IFERROR((RANK(T213,$T$3:$T$191,0)+COUNTIF($T$3:T213, T213)-1), \"\")","v":""},{"$f":"IFERROR(INDEX($C$2:$C$1840,_xlfn.AGGREGATE(15,3,(($A$2:$A$1840=$N$3)/($A$2:$A$1840=$N$3)*ROW($A$2:$A$1840))-ROW($A$1), ROWS($M$3:M213))), \"\")","v":""},{"$f":"IFERROR(INDEX($B$2:$B$1840,_xlfn.AGGREGATE(15,3,(($A$2:$A$1840=$N$3)/($A$2:$A$1840=$N$3)*ROW($A$2:$A$1840))-ROW($A$1), ROWS($M$3:M213))), \"\")","v":""},{"$f":"IFERROR(INDEX($J$2:$J$1840,_xlfn.AGGREGATE(15,3,(($A$2:$A$1840=$N$3)/($A$2:$A$1840=$N$3)*ROW($A$2:$A$1840))-ROW($A$1), ROWS($M$3:M213))), \"\")","v":""},{"$f":"IFERROR(INDEX($G$2:$G$1840,_xlfn.AGGREGATE(15,3,(($A$2:$A$1840=$N$3)/($A$2:$A$1840=$N$3)*ROW($A$2:$A$1840))-ROW($A$1), ROWS($M$3:M213))), \"\")","v":""},""]
["0035","New Mission High School","00350542",null,"07 - 12","SW",471,null,"MSHS/K-12",294,468.8,null,null,null,{"$f":"IFERROR((RANK(T214,$T$3:$T$191,0)+COUNTIF($T$3:T214, T214)-1), \"\")","v":""},{"$f":"IFERROR(INDEX($C$2:$C$1840,_xlfn.AGGREGATE(15,3,(($A$2:$A$1840=$N$3)/($A$2:$A$1840=$N$3)*ROW($A$2:$A$1840))-ROW($A$1), ROWS($M$3:M214))), \"\")","v":""},{"$f":"IFERROR(INDEX($B$2:$B$1840,_xlfn.AGGREGATE(15,3,(($A$2:$A$1840=$N$3)/($A$2:$A$1840=$N$3)*ROW($A$2:$A$1840))-ROW($A$1), ROWS($M$3:M214))), \"\")","v":""},{"$f":"IFERROR(INDEX($J$2:$J$1840,_xlfn.AGGREGATE(15,3,(($A$2:$A$1840=$N$3)/($A$2:$A$1840=$N$3)*ROW($A$2:$A$1840))-ROW($A$1), ROWS($M$3:M214))), \"\")","v":""},{"$f":"IFERROR(INDEX($G$2:$G$1840,_xlfn.AGGREGATE(15,3,(($A$2:$A$1840=$N$3)/($A$2:$A$1840=$N$3)*ROW($A$2:$A$1840))-ROW($A$1), ROWS($M$3:M214))), \"\")","v":""},""]
["0035","Greater Egleston Community High School","00350543",null,"09 - 12","SW",115,null,"HS",95,150.4,null,null,null,{"$f":"IFERROR((RANK(T215,$T$3:$T$191,0)+COUNTIF($T$3:T215, T215)-1), \"\")","v":""},{"$f":"IFERROR(INDEX($C$2:$C$1840,_xlfn.AGGREGATE(15,3,(($A$2:$A$1840=$N$3)/($A$2:$A$1840=$N$3)*ROW($A$2:$A$1840))-ROW($A$1), ROWS($M$3:M215))), \"\")","v":""},{"$f":"IFERROR(INDEX($B$2:$B$1840,_xlfn.AGGREGATE(15,3,(($A$2:$A$1840=$N$3)/($A$2:$A$1840=$N$3)*ROW($A$2:$A$1840))-ROW($A$1), ROWS($M$3:M215))), \"\")","v":""},{"$f":"IFERROR(INDEX($J$2:$J$1840,_xlfn.AGGREGATE(15,3,(($A$2:$A$1840=$N$3)/($A$2:$A$1840=$N$3)*ROW($A$2:$A$1840))-ROW($A$1), ROWS($M$3:M215))), \"\")","v":""},{"$f":"IFERROR(INDEX($G$2:$G$1840,_xlfn.AGGREGATE(15,3,(($A$2:$A$1840=$N$3)/($A$2:$A$1840=$N$3)*ROW($A$2:$A$1840))-ROW($A$1), ROWS($M$3:M215))), \"\")","v":""},""]
["0035","Boston Latin Academy","00350545",null,"07 - 12","SW",1771,null,"MSHS/K-12",647,1035.2,null,null,null,{"$f":"IFERROR((RANK(T216,$T$3:$T$191,0)+COUNTIF($T$3:T216, T216)-1), \"\")","v":""},{"$f":"IFERROR(INDEX($C$2:$C$1840,_xlfn.AGGREGATE(15,3,(($A$2:$A$1840=$N$3)/($A$2:$A$1840=$N$3)*ROW($A$2:$A$1840))-ROW($A$1), ROWS($M$3:M216))), \"\")","v":""},{"$f":"IFERROR(INDEX($B$2:$B$1840,_xlfn.AGGREGATE(15,3,(($A$2:$A$1840=$N$3)/($A$2:$A$1840=$N$3)*ROW($A$2:$A$1840))-ROW($A$1), ROWS($M$3:M216))), \"\")","v":""},{"$f":"IFERROR(INDEX($J$2:$J$1840,_xlfn.AGGREGATE(15,3,(($A$2:$A$1840=$N$3)/($A$2:$A$1840=$N$3)*ROW($A$2:$A$1840))-ROW($A$1), ROWS($M$3:M216))), \"\")","v":""},{"$f":"IFERROR(INDEX($G$2:$G$1840,_xlfn.AGGREGATE(15,3,(($A$2:$A$1840=$N$3)/($A$2:$A$1840=$N$3)*ROW($A$2:$A$1840))-ROW($A$1), ROWS($M$3:M216))), \"\")","v":""},""]
["0035","Boston Arts Academy","00350546",null,"09 - 12","SW",478,null,"HS",272,435.20000000000005,null,null,null,{"$f":"IFERROR((RANK(T217,$T$3:$T$191,0)+COUNTIF($T$3:T217, T217)-1), \"\")","v":""},{"$f":"IFERROR(INDEX($C$2:$C$1840,_xlfn.AGGREGATE(15,3,(($A$2:$A$1840=$N$3)/($A$2:$A$1840=$N$3)*ROW($A$2:$A$1840))-ROW($A$1), ROWS($M$3:M217))), \"\")","v":""},{"$f":"IFERROR(INDEX($B$2:$B$1840,_xlfn.AGGREGATE(15,3,(($A$2:$A$1840=$N$3)/($A$2:$A$1840=$N$3)*ROW($A$2:$A$1840))-ROW($A$1), ROWS($M$3:M217))), \"\")","v":""},{"$f":"IFERROR(INDEX($J$2:$J$1840,_xlfn.AGGREGATE(15,3,(($A$2:$A$1840=$N$3)/($A$2:$A$1840=$N$3)*ROW($A$2:$A$1840))-ROW($A$1), ROWS($M$3:M217))), \"\")","v":""},{"$f":"IFERROR(INDEX($G$2:$G$1840,_xlfn.AGGREGATE(15,3,(($A$2:$A$1840=$N$3)/($A$2:$A$1840=$N$3)*ROW($A$2:$A$1840))-ROW($A$1), ROWS($M$3:M217))), \"\")","v":""},""]
["0035","Boston Adult Academy","00350548",null,"11 - 12","SW",176,null,"HS",131,209.60000000000002,null,null,null,{"$f":"IFERROR((RANK(T218,$T$3:$T$191,0)+COUNTIF($T$3:T218, T218)-1), \"\")","v":""},{"$f":"IFERROR(INDEX($C$2:$C$1840,_xlfn.AGGREGATE(15,3,(($A$2:$A$1840=$N$3)/($A$2:$A$1840=$N$3)*ROW($A$2:$A$1840))-ROW($A$1), ROWS($M$3:M218))), \"\")","v":""},{"$f":"IFERROR(INDEX($B$2:$B$1840,_xlfn.AGGREGATE(15,3,(($A$2:$A$1840=$N$3)/($A$2:$A$1840=$N$3)*ROW($A$2:$A$1840))-ROW($A$1), ROWS($M$3:M218))), \"\")","v":""},{"$f":"IFERROR(INDEX($J$2:$J$1840,_xlfn.AGGREGATE(15,3,(($A$2:$A$1840=$N$3)/($A$2:$A$1840=$N$3)*ROW($A$2:$A$1840))-ROW($A$1), ROWS($M$3:M218))), \"\")","v":""},{"$f":"IFERROR(INDEX($G$2:$G$1840,_xlfn.AGGREGATE(15,3,(($A$2:$A$1840=$N$3)/($A$2:$A$1840=$N$3)*ROW($A$2:$A$1840))-ROW($A$1), ROWS($M$3:M218))), \"\")","v":""},""]
["0035","Margarita Muniz Academy","00350549",null,"09 - 12","SW",314,null,"HS",243,388.8,null,null,null,{"$f":"IFERROR((RANK(T219,$T$3:$T$191,0)+COUNTIF($T$3:T219, T219)-1), \"\")","v":""},{"$f":"IFERROR(INDEX($C$2:$C$1840,_xlfn.AGGREGATE(15,3,(($A$2:$A$1840=$N$3)/($A$2:$A$1840=$N$3)*ROW($A$2:$A$1840))-ROW($A$1), ROWS($M$3:M219))), \"\")","v":""},{"$f":"IFERROR(INDEX($B$2:$B$1840,_xlfn.AGGREGATE(15,3,(($A$2:$A$1840=$N$3)/($A$2:$A$1840=$N$3)*ROW($A$2:$A$1840))-ROW($A$1), ROWS($M$3:M219))), \"\")","v":""},{"$f":"IFERROR(INDEX($J$2:$J$1840,_xlfn.AGGREGATE(15,3,(($A$2:$A$1840=$N$3)/($A$2:$A$1840=$N$3)*ROW($A$2:$A$1840))-ROW($A$1), ROWS($M$3:M219))), \"\")","v":""},{"$f":"IFERROR(INDEX($G$2:$G$1840,_xlfn.AGGREGATE(15,3,(($A$2:$A$1840=$N$3)/($A$2:$A$1840=$N$3)*ROW($A$2:$A$1840))-ROW($A$1), ROWS($M$3:M219))), \"\")","v":""},""]
["0035","Boston Community Leadership Academy","00350558",null,"09 - 12","SW",471,null,"HS",344,526.4,null,null,null,{"$f":"IFERROR((RANK(T220,$T$3:$T$191,0)+COUNTIF($T$3:T220, T220)-1), \"\")","v":""},{"$f":"IFERROR(INDEX($C$2:$C$1840,_xlfn.AGGREGATE(15,3,(($A$2:$A$1840=$N$3)/($A$2:$A$1840=$N$3)*ROW($A$2:$A$1840))-ROW($A$1), ROWS($M$3:M220))), \"\")","v":""},{"$f":"IFERROR(INDEX($B$2:$B$1840,_xlfn.AGGREGATE(15,3,(($A$2:$A$1840=$N$3)/($A$2:$A$1840=$N$3)*ROW($A$2:$A$1840))-ROW($A$1), ROWS($M$3:M220))), \"\")","v":""},{"$f":"IFERROR(INDEX($J$2:$J$1840,_xlfn.AGGREGATE(15,3,(($A$2:$A$1840=$N$3)/($A$2:$A$1840=$N$3)*ROW($A$2:$A$1840))-ROW($A$1), ROWS($M$3:M220))), \"\")","v":""},{"$f":"IFERROR(INDEX($G$2:$G$1840,_xlfn.AGGREGATE(15,3,(($A$2:$A$1840=$N$3)/($A$2:$A$1840=$N$3)*ROW($A$2:$A$1840))-ROW($A$1), ROWS($M$3:M220))), \"\")","v":""},""]
["0035","Boston Latin","00350560",null,"07 - 12","SW",2472,null,"MSHS/K-12",460,736,null,null,null,{"$f":"IFERROR((RANK(T221,$T$3:$T$191,0)+COUNTIF($T$3:T221, T221)-1), \"\")","v":""},{"$f":"IFERROR(INDEX($C$2:$C$1840,_xlfn.AGGREGATE(15,3,(($A$2:$A$1840=$N$3)/($A$2:$A$1840=$N$3)*ROW($A$2:$A$1840))-ROW($A$1), ROWS($M$3:M221))), \"\")","v":""},{"$f":"IFERROR(INDEX($B$2:$B$1840,_xlfn.AGGREGATE(15,3,(($A$2:$A$1840=$N$3)/($A$2:$A$1840=$N$3)*ROW($A$2:$A$1840))-ROW($A$1), ROWS($M$3:M221))), \"\")","v":""},{"$f":"IFERROR(INDEX($J$2:$J$1840,_xlfn.AGGREGATE(15,3,(($A$2:$A$1840=$N$3)/($A$2:$A$1840=$N$3)*ROW($A$2:$A$1840))-ROW($A$1), ROWS($M$3:M221))), \"\")","v":""},{"$f":"IFERROR(INDEX($G$2:$G$1840,_xlfn.AGGREGATE(15,3,(($A$2:$A$1840=$N$3)/($A$2:$A$1840=$N$3)*ROW($A$2:$A$1840))-ROW($A$1), ROWS($M$3:M221))), \"\")","v":""},""]
["0035","Quincy Upper School","00350565",null,"06 - 12","SW",534,null,"MSHS/K-12",328,505.6,null,null,null,{"$f":"IFERROR((RANK(T222,$T$3:$T$191,0)+COUNTIF($T$3:T222, T222)-1), \"\")","v":""},{"$f":"IFERROR(INDEX($C$2:$C$1840,_xlfn.AGGREGATE(15,3,(($A$2:$A$1840=$N$3)/($A$2:$A$1840=$N$3)*ROW($A$2:$A$1840))-ROW($A$1), ROWS($M$3:M222))), \"\")","v":""},{"$f":"IFERROR(INDEX($B$2:$B$1840,_xlfn.AGGREGATE(15,3,(($A$2:$A$1840=$N$3)/($A$2:$A$1840=$N$3)*ROW($A$2:$A$1840))-ROW($A$1), ROWS($M$3:M222))), \"\")","v":""},{"$f":"IFERROR(INDEX($J$2:$J$1840,_xlfn.AGGREGATE(15,3,(($A$2:$A$1840=$N$3)/($A$2:$A$1840=$N$3)*ROW($A$2:$A$1840))-ROW($A$1), ROWS($M$3:M222))), \"\")","v":""},{"$f":"IFERROR(INDEX($G$2:$G$1840,_xlfn.AGGREGATE(15,3,(($A$2:$A$1840=$N$3)/($A$2:$A$1840=$N$3)*ROW($A$2:$A$1840))-ROW($A$1), ROWS($M$3:M222))), \"\")","v":""},""]
["0035","O'Bryant School Math/Science","00350575",null,"07 - 12","SW",1616,null,"MSHS/K-12",831,1329.6000000000001,null,null,null,{"$f":"IFERROR((RANK(T223,$T$3:$T$191,0)+COUNTIF($T$3:T223, T223)-1), \"\")","v":""},{"$f":"IFERROR(INDEX($C$2:$C$1840,_xlfn.AGGREGATE(15,3,(($A$2:$A$1840=$N$3)/($A$2:$A$1840=$N$3)*ROW($A$2:$A$1840))-ROW($A$1), ROWS($M$3:M223))), \"\")","v":""},{"$f":"IFERROR(INDEX($B$2:$B$1840,_xlfn.AGGREGATE(15,3,(($A$2:$A$1840=$N$3)/($A$2:$A$1840=$N$3)*ROW($A$2:$A$1840))-ROW($A$1), ROWS($M$3:M223))), \"\")","v":""},{"$f":"IFERROR(INDEX($J$2:$J$1840,_xlfn.AGGREGATE(15,3,(($A$2:$A$1840=$N$3)/($A$2:$A$1840=$N$3)*ROW($A$2:$A$1840))-ROW($A$1), ROWS($M$3:M223))), \"\")","v":""},{"$f":"IFERROR(INDEX($G$2:$G$1840,_xlfn.AGGREGATE(15,3,(($A$2:$A$1840=$N$3)/($A$2:$A$1840=$N$3)*ROW($A$2:$A$1840))-ROW($A$1), ROWS($M$3:M223))), \"\")","v":""},""]
["0035","Community Academy of Science and Health","00350581",null,"09 - 12","SW",346,null,"HS",266,422.40000000000003,null,null,null,{"$f":"IFERROR((RANK(T224,$T$3:$T$191,0)+COUNTIF($T$3:T224, T224)-1), \"\")","v":""},{"$f":"IFERROR(INDEX($C$2:$C$1840,_xlfn.AGGREGATE(15,3,(($A$2:$A$1840=$N$3)/($A$2:$A$1840=$N$3)*ROW($A$2:$A$1840))-ROW($A$1), ROWS($M$3:M224))), \"\")","v":""},{"$f":"IFERROR(INDEX($B$2:$B$1840,_xlfn.AGGREGATE(15,3,(($A$2:$A$1840=$N$3)/($A$2:$A$1840=$N$3)*ROW($A$2:$A$1840))-ROW($A$1), ROWS($M$3:M224))), \"\")","v":""},{"$f":"IFERROR(INDEX($J$2:$J$1840,_xlfn.AGGREGATE(15,3,(($A$2:$A$1840=$N$3)/($A$2:$A$1840=$N$3)*ROW($A$2:$A$1840))-ROW($A$1), ROWS($M$3:M224))), \"\")","v":""},{"$f":"IFERROR(INDEX($G$2:$G$1840,_xlfn.AGGREGATE(15,3,(($A$2:$A$1840=$N$3)/($A$2:$A$1840=$N$3)*ROW($A$2:$A$1840))-ROW($A$1), ROWS($M$3:M224))), \"\")","v":""},""]
["0035","Lyon Upper 9-12","00350655",null,"09 - 12","SW",139,null,"HS",85,136,null,null,null,{"$f":"IFERROR((RANK(T225,$T$3:$T$191,0)+COUNTIF($T$3:T225, T225)-1), \"\")","v":""},{"$f":"IFERROR(INDEX($C$2:$C$1840,_xlfn.AGGREGATE(15,3,(($A$2:$A$1840=$N$3)/($A$2:$A$1840=$N$3)*ROW($A$2:$A$1840))-ROW($A$1), ROWS($M$3:M225))), \"\")","v":""},{"$f":"IFERROR(INDEX($B$2:$B$1840,_xlfn.AGGREGATE(15,3,(($A$2:$A$1840=$N$3)/($A$2:$A$1840=$N$3)*ROW($A$2:$A$1840))-ROW($A$1), ROWS($M$3:M225))), \"\")","v":""},{"$f":"IFERROR(INDEX($J$2:$J$1840,_xlfn.AGGREGATE(15,3,(($A$2:$A$1840=$N$3)/($A$2:$A$1840=$N$3)*ROW($A$2:$A$1840))-ROW($A$1), ROWS($M$3:M225))), \"\")","v":""},{"$f":"IFERROR(INDEX($G$2:$G$1840,_xlfn.AGGREGATE(15,3,(($A$2:$A$1840=$N$3)/($A$2:$A$1840=$N$3)*ROW($A$2:$A$1840))-ROW($A$1), ROWS($M$3:M225))), \"\")","v":""},""]
["0035","Mario Umana Academy","00350656",null,"PK - 08","SW",762,null,"ESMS",536,827.2,null,null,null,{"$f":"IFERROR((RANK(T226,$T$3:$T$191,0)+COUNTIF($T$3:T226, T226)-1), \"\")","v":""},{"$f":"IFERROR(INDEX($C$2:$C$1840,_xlfn.AGGREGATE(15,3,(($A$2:$A$1840=$N$3)/($A$2:$A$1840=$N$3)*ROW($A$2:$A$1840))-ROW($A$1), ROWS($M$3:M226))), \"\")","v":""},{"$f":"IFERROR(INDEX($B$2:$B$1840,_xlfn.AGGREGATE(15,3,(($A$2:$A$1840=$N$3)/($A$2:$A$1840=$N$3)*ROW($A$2:$A$1840))-ROW($A$1), ROWS($M$3:M226))), \"\")","v":""},{"$f":"IFERROR(INDEX($J$2:$J$1840,_xlfn.AGGREGATE(15,3,(($A$2:$A$1840=$N$3)/($A$2:$A$1840=$N$3)*ROW($A$2:$A$1840))-ROW($A$1), ROWS($M$3:M226))), \"\")","v":""},{"$f":"IFERROR(INDEX($G$2:$G$1840,_xlfn.AGGREGATE(15,3,(($A$2:$A$1840=$N$3)/($A$2:$A$1840=$N$3)*ROW($A$2:$A$1840))-ROW($A$1), ROWS($M$3:M226))), \"\")","v":""},""]
["0035","TechBoston Academy","00350657",null,"06 - 12","SW",907,null,"MSHS/K-12",683,1092.8,null,null,null,{"$f":"IFERROR((RANK(T227,$T$3:$T$191,0)+COUNTIF($T$3:T227, T227)-1), \"\")","v":""},{"$f":"IFERROR(INDEX($C$2:$C$1840,_xlfn.AGGREGATE(15,3,(($A$2:$A$1840=$N$3)/($A$2:$A$1840=$N$3)*ROW($A$2:$A$1840))-ROW($A$1), ROWS($M$3:M227))), \"\")","v":""},{"$f":"IFERROR(INDEX($B$2:$B$1840,_xlfn.AGGREGATE(15,3,(($A$2:$A$1840=$N$3)/($A$2:$A$1840=$N$3)*ROW($A$2:$A$1840))-ROW($A$1), ROWS($M$3:M227))), \"\")","v":""},{"$f":"IFERROR(INDEX($J$2:$J$1840,_xlfn.AGGREGATE(15,3,(($A$2:$A$1840=$N$3)/($A$2:$A$1840=$N$3)*ROW($A$2:$A$1840))-ROW($A$1), ROWS($M$3:M227))), \"\")","v":""},{"$f":"IFERROR(INDEX($G$2:$G$1840,_xlfn.AGGREGATE(15,3,(($A$2:$A$1840=$N$3)/($A$2:$A$1840=$N$3)*ROW($A$2:$A$1840))-ROW($A$1), ROWS($M$3:M227))), \"\")","v":""},""]
["0035","Snowden International School at Copley","00350690",null,"09 - 12","SW",486,null,"HS",356,569.6,null,null,null,{"$f":"IFERROR((RANK(T228,$T$3:$T$191,0)+COUNTIF($T$3:T228, T228)-1), \"\")","v":""},{"$f":"IFERROR(INDEX($C$2:$C$1840,_xlfn.AGGREGATE(15,3,(($A$2:$A$1840=$N$3)/($A$2:$A$1840=$N$3)*ROW($A$2:$A$1840))-ROW($A$1), ROWS($M$3:M228))), \"\")","v":""},{"$f":"IFERROR(INDEX($B$2:$B$1840,_xlfn.AGGREGATE(15,3,(($A$2:$A$1840=$N$3)/($A$2:$A$1840=$N$3)*ROW($A$2:$A$1840))-ROW($A$1), ROWS($M$3:M228))), \"\")","v":""},{"$f":"IFERROR(INDEX($J$2:$J$1840,_xlfn.AGGREGATE(15,3,(($A$2:$A$1840=$N$3)/($A$2:$A$1840=$N$3)*ROW($A$2:$A$1840))-ROW($A$1), ROWS($M$3:M228))), \"\")","v":""},{"$f":"IFERROR(INDEX($G$2:$G$1840,_xlfn.AGGREGATE(15,3,(($A$2:$A$1840=$N$3)/($A$2:$A$1840=$N$3)*ROW($A$2:$A$1840))-ROW($A$1), ROWS($M$3:M228))), \"\")","v":""},""]
["0035","Rafael Hernandez","00350691",null,"PK - 08","SW",424,null,"ESMS",273,390.40000000000003,null,null,null,{"$f":"IFERROR((RANK(T229,$T$3:$T$191,0)+COUNTIF($T$3:T229, T229)-1), \"\")","v":""},{"$f":"IFERROR(INDEX($C$2:$C$1840,_xlfn.AGGREGATE(15,3,(($A$2:$A$1840=$N$3)/($A$2:$A$1840=$N$3)*ROW($A$2:$A$1840))-ROW($A$1), ROWS($M$3:M229))), \"\")","v":""},{"$f":"IFERROR(INDEX($B$2:$B$1840,_xlfn.AGGREGATE(15,3,(($A$2:$A$1840=$N$3)/($A$2:$A$1840=$N$3)*ROW($A$2:$A$1840))-ROW($A$1), ROWS($M$3:M229))), \"\")","v":""},{"$f":"IFERROR(INDEX($J$2:$J$1840,_xlfn.AGGREGATE(15,3,(($A$2:$A$1840=$N$3)/($A$2:$A$1840=$N$3)*ROW($A$2:$A$1840))-ROW($A$1), ROWS($M$3:M229))), \"\")","v":""},{"$f":"IFERROR(INDEX($G$2:$G$1840,_xlfn.AGGREGATE(15,3,(($A$2:$A$1840=$N$3)/($A$2:$A$1840=$N$3)*ROW($A$2:$A$1840))-ROW($A$1), ROWS($M$3:M229))), \"\")","v":""},""]
["0035","Horace Mann School for the Deaf","00350750",null,"PK - 06,08 - 12","SW",69,null,"MSHS/K-12",49,60.800000000000004,null,null,null,{"$f":"IFERROR((RANK(T230,$T$3:$T$191,0)+COUNTIF($T$3:T230, T230)-1), \"\")","v":""},{"$f":"IFERROR(INDEX($C$2:$C$1840,_xlfn.AGGREGATE(15,3,(($A$2:$A$1840=$N$3)/($A$2:$A$1840=$N$3)*ROW($A$2:$A$1840))-ROW($A$1), ROWS($M$3:M230))), \"\")","v":""},{"$f":"IFERROR(INDEX($B$2:$B$1840,_xlfn.AGGREGATE(15,3,(($A$2:$A$1840=$N$3)/($A$2:$A$1840=$N$3)*ROW($A$2:$A$1840))-ROW($A$1), ROWS($M$3:M230))), \"\")","v":""},{"$f":"IFERROR(INDEX($J$2:$J$1840,_xlfn.AGGREGATE(15,3,(($A$2:$A$1840=$N$3)/($A$2:$A$1840=$N$3)*ROW($A$2:$A$1840))-ROW($A$1), ROWS($M$3:M230))), \"\")","v":""},{"$f":"IFERROR(INDEX($G$2:$G$1840,_xlfn.AGGREGATE(15,3,(($A$2:$A$1840=$N$3)/($A$2:$A$1840=$N$3)*ROW($A$2:$A$1840))-ROW($A$1), ROWS($M$3:M230))), \"\")","v":""},""]
["0035","Boston Collaborative High School","00350755",null,"10 - 12","SW",179,null,"HS",140,220.8,null,null,null,{"$f":"IFERROR((RANK(T231,$T$3:$T$191,0)+COUNTIF($T$3:T231, T231)-1), \"\")","v":""},{"$f":"IFERROR(INDEX($C$2:$C$1840,_xlfn.AGGREGATE(15,3,(($A$2:$A$1840=$N$3)/($A$2:$A$1840=$N$3)*ROW($A$2:$A$1840))-ROW($A$1), ROWS($M$3:M231))), \"\")","v":""},{"$f":"IFERROR(INDEX($B$2:$B$1840,_xlfn.AGGREGATE(15,3,(($A$2:$A$1840=$N$3)/($A$2:$A$1840=$N$3)*ROW($A$2:$A$1840))-ROW($A$1), ROWS($M$3:M231))), \"\")","v":""},{"$f":"IFERROR(INDEX($J$2:$J$1840,_xlfn.AGGREGATE(15,3,(($A$2:$A$1840=$N$3)/($A$2:$A$1840=$N$3)*ROW($A$2:$A$1840))-ROW($A$1), ROWS($M$3:M231))), \"\")","v":""},{"$f":"IFERROR(INDEX($G$2:$G$1840,_xlfn.AGGREGATE(15,3,(($A$2:$A$1840=$N$3)/($A$2:$A$1840=$N$3)*ROW($A$2:$A$1840))-ROW($A$1), ROWS($M$3:M231))), \"\")","v":""},""]
["0036","Bournedale Elementary School","00360005",null,"PK - 02","TA",335,null,"EES",115,166.4,null,null,null,{"$f":"IFERROR((RANK(T232,$T$3:$T$191,0)+COUNTIF($T$3:T232, T232)-1), \"\")","v":""},{"$f":"IFERROR(INDEX($C$2:$C$1840,_xlfn.AGGREGATE(15,3,(($A$2:$A$1840=$N$3)/($A$2:$A$1840=$N$3)*ROW($A$2:$A$1840))-ROW($A$1), ROWS($M$3:M232))), \"\")","v":""},{"$f":"IFERROR(INDEX($B$2:$B$1840,_xlfn.AGGREGATE(15,3,(($A$2:$A$1840=$N$3)/($A$2:$A$1840=$N$3)*ROW($A$2:$A$1840))-ROW($A$1), ROWS($M$3:M232))), \"\")","v":""},{"$f":"IFERROR(INDEX($J$2:$J$1840,_xlfn.AGGREGATE(15,3,(($A$2:$A$1840=$N$3)/($A$2:$A$1840=$N$3)*ROW($A$2:$A$1840))-ROW($A$1), ROWS($M$3:M232))), \"\")","v":""},{"$f":"IFERROR(INDEX($G$2:$G$1840,_xlfn.AGGREGATE(15,3,(($A$2:$A$1840=$N$3)/($A$2:$A$1840=$N$3)*ROW($A$2:$A$1840))-ROW($A$1), ROWS($M$3:M232))), \"\")","v":""},""]
["0036","Bourne Intermediate School","00360030",null,"03 - 05","TA",412,null,"ES",147,235.20000000000002,null,null,null,{"$f":"IFERROR((RANK(T233,$T$3:$T$191,0)+COUNTIF($T$3:T233, T233)-1), \"\")","v":""},{"$f":"IFERROR(INDEX($C$2:$C$1840,_xlfn.AGGREGATE(15,3,(($A$2:$A$1840=$N$3)/($A$2:$A$1840=$N$3)*ROW($A$2:$A$1840))-ROW($A$1), ROWS($M$3:M233))), \"\")","v":""},{"$f":"IFERROR(INDEX($B$2:$B$1840,_xlfn.AGGREGATE(15,3,(($A$2:$A$1840=$N$3)/($A$2:$A$1840=$N$3)*ROW($A$2:$A$1840))-ROW($A$1), ROWS($M$3:M233))), \"\")","v":""},{"$f":"IFERROR(INDEX($J$2:$J$1840,_xlfn.AGGREGATE(15,3,(($A$2:$A$1840=$N$3)/($A$2:$A$1840=$N$3)*ROW($A$2:$A$1840))-ROW($A$1), ROWS($M$3:M233))), \"\")","v":""},{"$f":"IFERROR(INDEX($G$2:$G$1840,_xlfn.AGGREGATE(15,3,(($A$2:$A$1840=$N$3)/($A$2:$A$1840=$N$3)*ROW($A$2:$A$1840))-ROW($A$1), ROWS($M$3:M233))), \"\")","v":""},""]
["0036","Bourne Middle School","00360325",null,"06 - 08","NT",453,null,"MS",141,225.60000000000002,null,null,null,{"$f":"IFERROR((RANK(T234,$T$3:$T$191,0)+COUNTIF($T$3:T234, T234)-1), \"\")","v":""},{"$f":"IFERROR(INDEX($C$2:$C$1840,_xlfn.AGGREGATE(15,3,(($A$2:$A$1840=$N$3)/($A$2:$A$1840=$N$3)*ROW($A$2:$A$1840))-ROW($A$1), ROWS($M$3:M234))), \"\")","v":""},{"$f":"IFERROR(INDEX($B$2:$B$1840,_xlfn.AGGREGATE(15,3,(($A$2:$A$1840=$N$3)/($A$2:$A$1840=$N$3)*ROW($A$2:$A$1840))-ROW($A$1), ROWS($M$3:M234))), \"\")","v":""},{"$f":"IFERROR(INDEX($J$2:$J$1840,_xlfn.AGGREGATE(15,3,(($A$2:$A$1840=$N$3)/($A$2:$A$1840=$N$3)*ROW($A$2:$A$1840))-ROW($A$1), ROWS($M$3:M234))), \"\")","v":""},{"$f":"IFERROR(INDEX($G$2:$G$1840,_xlfn.AGGREGATE(15,3,(($A$2:$A$1840=$N$3)/($A$2:$A$1840=$N$3)*ROW($A$2:$A$1840))-ROW($A$1), ROWS($M$3:M234))), \"\")","v":""},""]
["0036","Bourne High School","00360505",null,"09 - 12","NT",425,null,"HS",108,160,null,null,null,{"$f":"IFERROR((RANK(T235,$T$3:$T$191,0)+COUNTIF($T$3:T235, T235)-1), \"\")","v":""},{"$f":"IFERROR(INDEX($C$2:$C$1840,_xlfn.AGGREGATE(15,3,(($A$2:$A$1840=$N$3)/($A$2:$A$1840=$N$3)*ROW($A$2:$A$1840))-ROW($A$1), ROWS($M$3:M235))), \"\")","v":""},{"$f":"IFERROR(INDEX($B$2:$B$1840,_xlfn.AGGREGATE(15,3,(($A$2:$A$1840=$N$3)/($A$2:$A$1840=$N$3)*ROW($A$2:$A$1840))-ROW($A$1), ROWS($M$3:M235))), \"\")","v":""},{"$f":"IFERROR(INDEX($J$2:$J$1840,_xlfn.AGGREGATE(15,3,(($A$2:$A$1840=$N$3)/($A$2:$A$1840=$N$3)*ROW($A$2:$A$1840))-ROW($A$1), ROWS($M$3:M235))), \"\")","v":""},{"$f":"IFERROR(INDEX($G$2:$G$1840,_xlfn.AGGREGATE(15,3,(($A$2:$A$1840=$N$3)/($A$2:$A$1840=$N$3)*ROW($A$2:$A$1840))-ROW($A$1), ROWS($M$3:M235))), \"\")","v":""},""]
["0038","Harry Lee Cole","00380005",null,"PK - 02","TA",292,null,"EES",22,35.200000000000003,null,null,null,{"$f":"IFERROR((RANK(T236,$T$3:$T$191,0)+COUNTIF($T$3:T236, T236)-1), \"\")","v":""},{"$f":"IFERROR(INDEX($C$2:$C$1840,_xlfn.AGGREGATE(15,3,(($A$2:$A$1840=$N$3)/($A$2:$A$1840=$N$3)*ROW($A$2:$A$1840))-ROW($A$1), ROWS($M$3:M236))), \"\")","v":""},{"$f":"IFERROR(INDEX($B$2:$B$1840,_xlfn.AGGREGATE(15,3,(($A$2:$A$1840=$N$3)/($A$2:$A$1840=$N$3)*ROW($A$2:$A$1840))-ROW($A$1), ROWS($M$3:M236))), \"\")","v":""},{"$f":"IFERROR(INDEX($J$2:$J$1840,_xlfn.AGGREGATE(15,3,(($A$2:$A$1840=$N$3)/($A$2:$A$1840=$N$3)*ROW($A$2:$A$1840))-ROW($A$1), ROWS($M$3:M236))), \"\")","v":""},{"$f":"IFERROR(INDEX($G$2:$G$1840,_xlfn.AGGREGATE(15,3,(($A$2:$A$1840=$N$3)/($A$2:$A$1840=$N$3)*ROW($A$2:$A$1840))-ROW($A$1), ROWS($M$3:M236))), \"\")","v":""},""]
["0038","Spofford Pond","00380013",null,"03 - 06","TA",380,null,"ES",31,49.6,null,null,null,{"$f":"IFERROR((RANK(T237,$T$3:$T$191,0)+COUNTIF($T$3:T237, T237)-1), \"\")","v":""},{"$f":"IFERROR(INDEX($C$2:$C$1840,_xlfn.AGGREGATE(15,3,(($A$2:$A$1840=$N$3)/($A$2:$A$1840=$N$3)*ROW($A$2:$A$1840))-ROW($A$1), ROWS($M$3:M237))), \"\")","v":""},{"$f":"IFERROR(INDEX($B$2:$B$1840,_xlfn.AGGREGATE(15,3,(($A$2:$A$1840=$N$3)/($A$2:$A$1840=$N$3)*ROW($A$2:$A$1840))-ROW($A$1), ROWS($M$3:M237))), \"\")","v":""},{"$f":"IFERROR(INDEX($J$2:$J$1840,_xlfn.AGGREGATE(15,3,(($A$2:$A$1840=$N$3)/($A$2:$A$1840=$N$3)*ROW($A$2:$A$1840))-ROW($A$1), ROWS($M$3:M237))), \"\")","v":""},{"$f":"IFERROR(INDEX($G$2:$G$1840,_xlfn.AGGREGATE(15,3,(($A$2:$A$1840=$N$3)/($A$2:$A$1840=$N$3)*ROW($A$2:$A$1840))-ROW($A$1), ROWS($M$3:M237))), \"\")","v":""},""]
["0040","Hollis","00400005",null,"K - 04","NT",324,null,"ES",67,107.2,null,null,null,{"$f":"IFERROR((RANK(T238,$T$3:$T$191,0)+COUNTIF($T$3:T238, T238)-1), \"\")","v":""},{"$f":"IFERROR(INDEX($C$2:$C$1840,_xlfn.AGGREGATE(15,3,(($A$2:$A$1840=$N$3)/($A$2:$A$1840=$N$3)*ROW($A$2:$A$1840))-ROW($A$1), ROWS($M$3:M238))), \"\")","v":""},{"$f":"IFERROR(INDEX($B$2:$B$1840,_xlfn.AGGREGATE(15,3,(($A$2:$A$1840=$N$3)/($A$2:$A$1840=$N$3)*ROW($A$2:$A$1840))-ROW($A$1), ROWS($M$3:M238))), \"\")","v":""},{"$f":"IFERROR(INDEX($J$2:$J$1840,_xlfn.AGGREGATE(15,3,(($A$2:$A$1840=$N$3)/($A$2:$A$1840=$N$3)*ROW($A$2:$A$1840))-ROW($A$1), ROWS($M$3:M238))), \"\")","v":""},{"$f":"IFERROR(INDEX($G$2:$G$1840,_xlfn.AGGREGATE(15,3,(($A$2:$A$1840=$N$3)/($A$2:$A$1840=$N$3)*ROW($A$2:$A$1840))-ROW($A$1), ROWS($M$3:M238))), \"\")","v":""},""]
["0040","Monatiquot Kindergarten Center","00400009",null,"K","NT",147,null,"EES",37,59.2,null,null,null,{"$f":"IFERROR((RANK(T239,$T$3:$T$191,0)+COUNTIF($T$3:T239, T239)-1), \"\")","v":""},{"$f":"IFERROR(INDEX($C$2:$C$1840,_xlfn.AGGREGATE(15,3,(($A$2:$A$1840=$N$3)/($A$2:$A$1840=$N$3)*ROW($A$2:$A$1840))-ROW($A$1), ROWS($M$3:M239))), \"\")","v":""},{"$f":"IFERROR(INDEX($B$2:$B$1840,_xlfn.AGGREGATE(15,3,(($A$2:$A$1840=$N$3)/($A$2:$A$1840=$N$3)*ROW($A$2:$A$1840))-ROW($A$1), ROWS($M$3:M239))), \"\")","v":""},{"$f":"IFERROR(INDEX($J$2:$J$1840,_xlfn.AGGREGATE(15,3,(($A$2:$A$1840=$N$3)/($A$2:$A$1840=$N$3)*ROW($A$2:$A$1840))-ROW($A$1), ROWS($M$3:M239))), \"\")","v":""},{"$f":"IFERROR(INDEX($G$2:$G$1840,_xlfn.AGGREGATE(15,3,(($A$2:$A$1840=$N$3)/($A$2:$A$1840=$N$3)*ROW($A$2:$A$1840))-ROW($A$1), ROWS($M$3:M239))), \"\")","v":""},""]
["0040","Highlands","00400015",null,"K - 05","NT",400,null,"ES",51,81.600000000000009,null,null,null,{"$f":"IFERROR((RANK(T240,$T$3:$T$191,0)+COUNTIF($T$3:T240, T240)-1), \"\")","v":""},{"$f":"IFERROR(INDEX($C$2:$C$1840,_xlfn.AGGREGATE(15,3,(($A$2:$A$1840=$N$3)/($A$2:$A$1840=$N$3)*ROW($A$2:$A$1840))-ROW($A$1), ROWS($M$3:M240))), \"\")","v":""},{"$f":"IFERROR(INDEX($B$2:$B$1840,_xlfn.AGGREGATE(15,3,(($A$2:$A$1840=$N$3)/($A$2:$A$1840=$N$3)*ROW($A$2:$A$1840))-ROW($A$1), ROWS($M$3:M240))), \"\")","v":""},{"$f":"IFERROR(INDEX($J$2:$J$1840,_xlfn.AGGREGATE(15,3,(($A$2:$A$1840=$N$3)/($A$2:$A$1840=$N$3)*ROW($A$2:$A$1840))-ROW($A$1), ROWS($M$3:M240))), \"\")","v":""},{"$f":"IFERROR(INDEX($G$2:$G$1840,_xlfn.AGGREGATE(15,3,(($A$2:$A$1840=$N$3)/($A$2:$A$1840=$N$3)*ROW($A$2:$A$1840))-ROW($A$1), ROWS($M$3:M240))), \"\")","v":""},""]
["0040","Mary E Flaherty School","00400020",null,"K - 04","NT",275,null,"ES",59,94.4,null,null,null,{"$f":"IFERROR((RANK($T241,$T$3:$T$191,0)+COUNTIF(T$3:T429, T241)-1), \"\")","v":""},{"$f":"IFERROR(INDEX($C$2:$C$1840,_xlfn.AGGREGATE(15,3,(($A$2:$A$1840=$N$3)/($A$2:$A$1840=$N$3)*ROW($A$2:$A$1840))-ROW($A$1), ROWS($M$3:M241))), \"\")","v":""},{"$f":"IFERROR(INDEX($B$2:$B$1840,_xlfn.AGGREGATE(15,3,(($A$2:$A$1840=$N$3)/($A$2:$A$1840=$N$3)*ROW($A$2:$A$1840))-ROW($A$1), ROWS($M$3:M241))), \"\")","v":""},{"$f":"IFERROR(INDEX($J$2:$J$1840,_xlfn.AGGREGATE(15,3,(($A$2:$A$1840=$N$3)/($A$2:$A$1840=$N$3)*ROW($A$2:$A$1840))-ROW($A$1), ROWS($M$3:M241))), \"\")","v":""},{"$f":"IFERROR(INDEX($G$2:$G$1840,_xlfn.AGGREGATE(15,3,(($A$2:$A$1840=$N$3)/($A$2:$A$1840=$N$3)*ROW($A$2:$A$1840))-ROW($A$1), ROWS($M$3:M241))), \"\")","v":""},""]
["0040","Liberty","00400025",null,"01 - 05","NT",333,null,"ES",56,89.600000000000009,null,null,null,{"$f":"IFERROR((RANK($T242,$T$3:$T$191,0)+COUNTIF(T$3:T430, T242)-1), \"\")","v":""},{"$f":"IFERROR(INDEX($C$2:$C$1840,_xlfn.AGGREGATE(15,3,(($A$2:$A$1840=$N$3)/($A$2:$A$1840=$N$3)*ROW($A$2:$A$1840))-ROW($A$1), ROWS($M$3:M242))), \"\")","v":""},{"$f":"IFERROR(INDEX($B$2:$B$1840,_xlfn.AGGREGATE(15,3,(($A$2:$A$1840=$N$3)/($A$2:$A$1840=$N$3)*ROW($A$2:$A$1840))-ROW($A$1), ROWS($M$3:M242))), \"\")","v":""},{"$f":"IFERROR(INDEX($J$2:$J$1840,_xlfn.AGGREGATE(15,3,(($A$2:$A$1840=$N$3)/($A$2:$A$1840=$N$3)*ROW($A$2:$A$1840))-ROW($A$1), ROWS($M$3:M242))), \"\")","v":""},{"$f":"IFERROR(INDEX($G$2:$G$1840,_xlfn.AGGREGATE(15,3,(($A$2:$A$1840=$N$3)/($A$2:$A$1840=$N$3)*ROW($A$2:$A$1840))-ROW($A$1), ROWS($M$3:M242))), \"\")","v":""},""]
["0040","Archie T Morrison","00400033",null,"K - 04","SW",316,null,"ES",108,172.8,null,null,null,{"$f":"IFERROR((RANK($T243,$T$3:$T$191,0)+COUNTIF(T$3:T431, T243)-1), \"\")","v":""},{"$f":"IFERROR(INDEX($C$2:$C$1840,_xlfn.AGGREGATE(15,3,(($A$2:$A$1840=$N$3)/($A$2:$A$1840=$N$3)*ROW($A$2:$A$1840))-ROW($A$1), ROWS($M$3:M243))), \"\")","v":""},{"$f":"IFERROR(INDEX($B$2:$B$1840,_xlfn.AGGREGATE(15,3,(($A$2:$A$1840=$N$3)/($A$2:$A$1840=$N$3)*ROW($A$2:$A$1840))-ROW($A$1), ROWS($M$3:M243))), \"\")","v":""},{"$f":"IFERROR(INDEX($J$2:$J$1840,_xlfn.AGGREGATE(15,3,(($A$2:$A$1840=$N$3)/($A$2:$A$1840=$N$3)*ROW($A$2:$A$1840))-ROW($A$1), ROWS($M$3:M243))), \"\")","v":""},{"$f":"IFERROR(INDEX($G$2:$G$1840,_xlfn.AGGREGATE(15,3,(($A$2:$A$1840=$N$3)/($A$2:$A$1840=$N$3)*ROW($A$2:$A$1840))-ROW($A$1), ROWS($M$3:M243))), \"\")","v":""},""]
["0040","Donald Ross","00400050",null,"K - 04","SW",260,null,"ES",72,115.2,null,null,null,{"$f":"IFERROR((RANK($T244,$T$3:$T$191,0)+COUNTIF(T$3:T432, T244)-1), \"\")","v":""},{"$f":"IFERROR(INDEX($C$2:$C$1840,_xlfn.AGGREGATE(15,3,(($A$2:$A$1840=$N$3)/($A$2:$A$1840=$N$3)*ROW($A$2:$A$1840))-ROW($A$1), ROWS($M$3:M244))), \"\")","v":""},{"$f":"IFERROR(INDEX($B$2:$B$1840,_xlfn.AGGREGATE(15,3,(($A$2:$A$1840=$N$3)/($A$2:$A$1840=$N$3)*ROW($A$2:$A$1840))-ROW($A$1), ROWS($M$3:M244))), \"\")","v":""},null,{"$f":"IFERROR(INDEX($G$2:$G$1840,_xlfn.AGGREGATE(15,3,(($A$2:$A$1840=$N$3)/($A$2:$A$1840=$N$3)*ROW($A$2:$A$1840))-ROW($A$1), ROWS($M$3:M244))), \"\")","v":""},""]
["0040","East Middle School","00400305",null,"05 - 08","NT",1048,null,"MS",303,484.8,null,null,null,{"$f":"IFERROR((RANK($T245,$T$3:$T$191,0)+COUNTIF(T$3:T433, T245)-1), \"\")","v":""},{"$f":"IFERROR(INDEX($C$2:$C$1840,_xlfn.AGGREGATE(15,3,(($A$2:$A$1840=$N$3)/($A$2:$A$1840=$N$3)*ROW($A$2:$A$1840))-ROW($A$1), ROWS($M$3:M245))), \"\")","v":""},{"$f":"IFERROR(INDEX($B$2:$B$1840,_xlfn.AGGREGATE(15,3,(($A$2:$A$1840=$N$3)/($A$2:$A$1840=$N$3)*ROW($A$2:$A$1840))-ROW($A$1), ROWS($M$3:M245))), \"\")","v":""},null,{"$f":"IFERROR(INDEX($G$2:$G$1840,_xlfn.AGGREGATE(15,3,(($A$2:$A$1840=$N$3)/($A$2:$A$1840=$N$3)*ROW($A$2:$A$1840))-ROW($A$1), ROWS($M$3:M245))), \"\")","v":""},""]
["0040","South Middle School","00400310",null,"06 - 08","NT",646,null,"MS",98,156.80000000000001,null,null,null,{"$f":"IFERROR((RANK($T246,$T$3:$T$191,0)+COUNTIF(T$3:T434, T246)-1), \"\")","v":""},{"$f":"IFERROR(INDEX($C$2:$C$1840,_xlfn.AGGREGATE(15,3,(($A$2:$A$1840=$N$3)/($A$2:$A$1840=$N$3)*ROW($A$2:$A$1840))-ROW($A$1), ROWS($M$3:M246))), \"\")","v":""},{"$f":"IFERROR(INDEX($B$2:$B$1840,_xlfn.AGGREGATE(15,3,(($A$2:$A$1840=$N$3)/($A$2:$A$1840=$N$3)*ROW($A$2:$A$1840))-ROW($A$1), ROWS($M$3:M246))), \"\")","v":""},null,{"$f":"IFERROR(INDEX($G$2:$G$1840,_xlfn.AGGREGATE(15,3,(($A$2:$A$1840=$N$3)/($A$2:$A$1840=$N$3)*ROW($A$2:$A$1840))-ROW($A$1), ROWS($M$3:M246))), \"\")","v":""},""]
["0040","Braintree High","00400505",null,"PK,09 - 12","NT",1739,null,"HS",387,569.6,null,null,null,{"$f":"IFERROR((RANK($T247,$T$3:$T$191,0)+COUNTIF(T$3:T435, T247)-1), \"\")","v":""},{"$f":"IFERROR(INDEX($C$2:$C$1840,_xlfn.AGGREGATE(15,3,(($A$2:$A$1840=$N$3)/($A$2:$A$1840=$N$3)*ROW($A$2:$A$1840))-ROW($A$1), ROWS($M$3:M247))), \"\")","v":""},{"$f":"IFERROR(INDEX($B$2:$B$1840,_xlfn.AGGREGATE(15,3,(($A$2:$A$1840=$N$3)/($A$2:$A$1840=$N$3)*ROW($A$2:$A$1840))-ROW($A$1), ROWS($M$3:M247))), \"\")","v":""},null,{"$f":"IFERROR(INDEX($G$2:$G$1840,_xlfn.AGGREGATE(15,3,(($A$2:$A$1840=$N$3)/($A$2:$A$1840=$N$3)*ROW($A$2:$A$1840))-ROW($A$1), ROWS($M$3:M247))), \"\")","v":""},""]
["0041","Stony Brook Elementary","00410005",null,"PK - 02","TA",217,null,"EES",79,108.80000000000001,null,null,null,{"$f":"IFERROR((RANK($T248,$T$3:$T$191,0)+COUNTIF(T$3:T436, T248)-1), \"\")","v":""},{"$f":"IFERROR(INDEX($C$2:$C$1840,_xlfn.AGGREGATE(15,3,(($A$2:$A$1840=$N$3)/($A$2:$A$1840=$N$3)*ROW($A$2:$A$1840))-ROW($A$1), ROWS($M$3:M248))), \"\")","v":""},{"$f":"IFERROR(INDEX($B$2:$B$1840,_xlfn.AGGREGATE(15,3,(($A$2:$A$1840=$N$3)/($A$2:$A$1840=$N$3)*ROW($A$2:$A$1840))-ROW($A$1), ROWS($M$3:M248))), \"\")","v":""},null,{"$f":"IFERROR(INDEX($G$2:$G$1840,_xlfn.AGGREGATE(15,3,(($A$2:$A$1840=$N$3)/($A$2:$A$1840=$N$3)*ROW($A$2:$A$1840))-ROW($A$1), ROWS($M$3:M248))), \"\")","v":""},""]
["0041","Eddy Elementary","00410010",null,"03 - 05","TA",212,null,"ES",56,89.600000000000009,null,null,null,{"$f":"IFERROR((RANK($T249,$T$3:$T$191,0)+COUNTIF(T$3:T437, T249)-1), \"\")","v":""},{"$f":"IFERROR(INDEX($C$2:$C$1840,_xlfn.AGGREGATE(15,3,(($A$2:$A$1840=$N$3)/($A$2:$A$1840=$N$3)*ROW($A$2:$A$1840))-ROW($A$1), ROWS($M$3:M249))), \"\")","v":""},{"$f":"IFERROR(INDEX($B$2:$B$1840,_xlfn.AGGREGATE(15,3,(($A$2:$A$1840=$N$3)/($A$2:$A$1840=$N$3)*ROW($A$2:$A$1840))-ROW($A$1), ROWS($M$3:M249))), \"\")","v":""},null,{"$f":"IFERROR(INDEX($G$2:$G$1840,_xlfn.AGGREGATE(15,3,(($A$2:$A$1840=$N$3)/($A$2:$A$1840=$N$3)*ROW($A$2:$A$1840))-ROW($A$1), ROWS($M$3:M249))), \"\")","v":""},""]
["0043","Brimfield Elementary","00430005",null,"PK - 06","TA",265,null,"ES",72,113.60000000000001,null,null,null,{"$f":"IFERROR((RANK($T250,$T$3:$T$191,0)+COUNTIF(T$3:T438, T250)-1), \"\")","v":""},{"$f":"IFERROR(INDEX($C$2:$C$1840,_xlfn.AGGREGATE(15,3,(($A$2:$A$1840=$N$3)/($A$2:$A$1840=$N$3)*ROW($A$2:$A$1840))-ROW($A$1), ROWS($M$3:M250))), \"\")","v":""},{"$f":"IFERROR(INDEX($B$2:$B$1840,_xlfn.AGGREGATE(15,3,(($A$2:$A$1840=$N$3)/($A$2:$A$1840=$N$3)*ROW($A$2:$A$1840))-ROW($A$1), ROWS($M$3:M250))), \"\")","v":""},null,{"$f":"IFERROR(INDEX($G$2:$G$1840,_xlfn.AGGREGATE(15,3,(($A$2:$A$1840=$N$3)/($A$2:$A$1840=$N$3)*ROW($A$2:$A$1840))-ROW($A$1), ROWS($M$3:M250))), \"\")","v":""},""]
["0044","Dr W Arnone Community School","00440001",null,"PK - 05","SW",726,null,"ES",514,771.2,null,null,null,{"$f":"IFERROR((RANK($T251,$T$3:$T$191,0)+COUNTIF(T$3:T439, T251)-1), \"\")","v":""},{"$f":"IFERROR(INDEX($C$2:$C$1840,_xlfn.AGGREGATE(15,3,(($A$2:$A$1840=$N$3)/($A$2:$A$1840=$N$3)*ROW($A$2:$A$1840))-ROW($A$1), ROWS($M$3:M251))), \"\")","v":""},{"$f":"IFERROR(INDEX($B$2:$B$1840,_xlfn.AGGREGATE(15,3,(($A$2:$A$1840=$N$3)/($A$2:$A$1840=$N$3)*ROW($A$2:$A$1840))-ROW($A$1), ROWS($M$3:M251))), \"\")","v":""},null,{"$f":"IFERROR(INDEX($G$2:$G$1840,_xlfn.AGGREGATE(15,3,(($A$2:$A$1840=$N$3)/($A$2:$A$1840=$N$3)*ROW($A$2:$A$1840))-ROW($A$1), ROWS($M$3:M251))), \"\")","v":""},""]
["0044","Mary E. Baker School","00440002",null,"K - 05","SW",626,null,"ES",376,601.6,null,null,null,{"$f":"IFERROR((RANK(T252,$T$3:$T$191,0)+COUNTIF(T$3:T440, T252)-1), \"\")","v":""},{"$f":"IFERROR(INDEX($C$2:$C$1840,_xlfn.AGGREGATE(15,3,(($A$2:$A$1840=$N$3)/($A$2:$A$1840=$N$3)*ROW($A$2:$A$1840))-ROW($A$1), ROWS($M$3:M252))), \"\")","v":""},{"$f":"IFERROR(INDEX($B$2:$B$1840,_xlfn.AGGREGATE(15,3,(($A$2:$A$1840=$N$3)/($A$2:$A$1840=$N$3)*ROW($A$2:$A$1840))-ROW($A$1), ROWS($M$3:M252))), \"\")","v":""},null,{"$f":"IFERROR(INDEX($G$2:$G$1840,_xlfn.AGGREGATE(15,3,(($A$2:$A$1840=$N$3)/($A$2:$A$1840=$N$3)*ROW($A$2:$A$1840))-ROW($A$1), ROWS($M$3:M252))), \"\")","v":""},""]
["0044","Manthala George Jr. School","00440003",null,"K - 05","SW",880,null,"ES",617,987.2,null,null,null,{"$f":"IFERROR((RANK(T253,$T$3:$T$191,0)+COUNTIF(T$3:T441, T253)-1), \"\")","v":""},{"$f":"IFERROR(INDEX($C$2:$C$1840,_xlfn.AGGREGATE(15,3,(($A$2:$A$1840=$N$3)/($A$2:$A$1840=$N$3)*ROW($A$2:$A$1840))-ROW($A$1), ROWS($M$3:M253))), \"\")","v":""},{"$f":"IFERROR(INDEX($B$2:$B$1840,_xlfn.AGGREGATE(15,3,(($A$2:$A$1840=$N$3)/($A$2:$A$1840=$N$3)*ROW($A$2:$A$1840))-ROW($A$1), ROWS($M$3:M253))), \"\")","v":""},null,{"$f":"IFERROR(INDEX($G$2:$G$1840,_xlfn.AGGREGATE(15,3,(($A$2:$A$1840=$N$3)/($A$2:$A$1840=$N$3)*ROW($A$2:$A$1840))-ROW($A$1), ROWS($M$3:M253))), \"\")","v":""},""]
["0044","Barrett Russell Early Childhood Center","00440008",null,"PK - K","NT",157,null,"EES",99,8,null,null,null,{"$f":"IFERROR((RANK(T254,$T$3:$T$191,0)+COUNTIF(T$3:T442, T254)-1), \"\")","v":""},{"$f":"IFERROR(INDEX($C$2:$C$1840,_xlfn.AGGREGATE(15,3,(($A$2:$A$1840=$N$3)/($A$2:$A$1840=$N$3)*ROW($A$2:$A$1840))-ROW($A$1), ROWS($M$3:M254))), \"\")","v":""},{"$f":"IFERROR(INDEX($B$2:$B$1840,_xlfn.AGGREGATE(15,3,(($A$2:$A$1840=$N$3)/($A$2:$A$1840=$N$3)*ROW($A$2:$A$1840))-ROW($A$1), ROWS($M$3:M254))), \"\")","v":""},null,{"$f":"IFERROR(INDEX($G$2:$G$1840,_xlfn.AGGREGATE(15,3,(($A$2:$A$1840=$N$3)/($A$2:$A$1840=$N$3)*ROW($A$2:$A$1840))-ROW($A$1), ROWS($M$3:M254))), \"\")","v":""},""]
["0044","Brookfield","00440010",null,"K - 05","SW",487,null,"ES",302,483.20000000000005,null,null,null,{"$f":"IFERROR((RANK(T255,$T$3:$T$191,0)+COUNTIF(T$3:T443, T255)-1), \"\")","v":""},{"$f":"IFERROR(INDEX($C$2:$C$1840,_xlfn.AGGREGATE(15,3,(($A$2:$A$1840=$N$3)/($A$2:$A$1840=$N$3)*ROW($A$2:$A$1840))-ROW($A$1), ROWS($M$3:M255))), \"\")","v":""},{"$f":"IFERROR(INDEX($B$2:$B$1840,_xlfn.AGGREGATE(15,3,(($A$2:$A$1840=$N$3)/($A$2:$A$1840=$N$3)*ROW($A$2:$A$1840))-ROW($A$1), ROWS($M$3:M255))), \"\")","v":""},null,{"$f":"IFERROR(INDEX($G$2:$G$1840,_xlfn.AGGREGATE(15,3,(($A$2:$A$1840=$N$3)/($A$2:$A$1840=$N$3)*ROW($A$2:$A$1840))-ROW($A$1), ROWS($M$3:M255))), \"\")","v":""},""]
["0044","John F Kennedy","00440017",null,"K - 05","SW",548,null,"ES",318,508.8,null,null,null,{"$f":"IFERROR((RANK(T256,$T$3:$T$191,0)+COUNTIF(T$3:T444, T256)-1), \"\")","v":""},{"$f":"IFERROR(INDEX($C$2:$C$1840,_xlfn.AGGREGATE(15,3,(($A$2:$A$1840=$N$3)/($A$2:$A$1840=$N$3)*ROW($A$2:$A$1840))-ROW($A$1), ROWS($M$3:M256))), \"\")","v":""},{"$f":"IFERROR(INDEX($B$2:$B$1840,_xlfn.AGGREGATE(15,3,(($A$2:$A$1840=$N$3)/($A$2:$A$1840=$N$3)*ROW($A$2:$A$1840))-ROW($A$1), ROWS($M$3:M256))), \"\")","v":""},null,{"$f":"IFERROR(INDEX($G$2:$G$1840,_xlfn.AGGREGATE(15,3,(($A$2:$A$1840=$N$3)/($A$2:$A$1840=$N$3)*ROW($A$2:$A$1840))-ROW($A$1), ROWS($M$3:M256))), \"\")","v":""},""]
["0044","Edgar B Davis","00440023",null,"K - 08","SW",1015,null,"ESMS",740,1184,null,null,null,{"$f":"IFERROR((RANK(T257,$T$3:$T$191,0)+COUNTIF(T$3:T445, T257)-1), \"\")","v":""},{"$f":"IFERROR(INDEX($C$2:$C$1840,_xlfn.AGGREGATE(15,3,(($A$2:$A$1840=$N$3)/($A$2:$A$1840=$N$3)*ROW($A$2:$A$1840))-ROW($A$1), ROWS($M$3:M257))), \"\")","v":""},{"$f":"IFERROR(INDEX($B$2:$B$1840,_xlfn.AGGREGATE(15,3,(($A$2:$A$1840=$N$3)/($A$2:$A$1840=$N$3)*ROW($A$2:$A$1840))-ROW($A$1), ROWS($M$3:M257))), \"\")","v":""},null,{"$f":"IFERROR(INDEX($G$2:$G$1840,_xlfn.AGGREGATE(15,3,(($A$2:$A$1840=$N$3)/($A$2:$A$1840=$N$3)*ROW($A$2:$A$1840))-ROW($A$1), ROWS($M$3:M257))), \"\")","v":""},""]
["0044","Hancock","00440045",null,"K - 05","SW",495,null,"ES",262,419.20000000000005,null,null,null,{"$f":"IFERROR((RANK(T258,$T$3:$T$191,0)+COUNTIF(T$3:T446, T258)-1), \"\")","v":""},{"$f":"IFERROR(INDEX($C$2:$C$1840,_xlfn.AGGREGATE(15,3,(($A$2:$A$1840=$N$3)/($A$2:$A$1840=$N$3)*ROW($A$2:$A$1840))-ROW($A$1), ROWS($M$3:M258))), \"\")","v":""},{"$f":"IFERROR(INDEX($B$2:$B$1840,_xlfn.AGGREGATE(15,3,(($A$2:$A$1840=$N$3)/($A$2:$A$1840=$N$3)*ROW($A$2:$A$1840))-ROW($A$1), ROWS($M$3:M258))), \"\")","v":""},null,{"$f":"IFERROR(INDEX($G$2:$G$1840,_xlfn.AGGREGATE(15,3,(($A$2:$A$1840=$N$3)/($A$2:$A$1840=$N$3)*ROW($A$2:$A$1840))-ROW($A$1), ROWS($M$3:M258))), \"\")","v":""},""]
["0044","Gilmore Elementary School","00440055",null,"K - 05","SW",449,null,"ES",339,542.4,null,null,null,{"$f":"IFERROR((RANK(T259,$T$3:$T$191,0)+COUNTIF(T$3:T447, T259)-1), \"\")","v":""},{"$f":"IFERROR(INDEX($C$2:$C$1840,_xlfn.AGGREGATE(15,3,(($A$2:$A$1840=$N$3)/($A$2:$A$1840=$N$3)*ROW($A$2:$A$1840))-ROW($A$1), ROWS($M$3:M259))), \"\")","v":""},{"$f":"IFERROR(INDEX($B$2:$B$1840,_xlfn.AGGREGATE(15,3,(($A$2:$A$1840=$N$3)/($A$2:$A$1840=$N$3)*ROW($A$2:$A$1840))-ROW($A$1), ROWS($M$3:M259))), \"\")","v":""},null,{"$f":"IFERROR(INDEX($G$2:$G$1840,_xlfn.AGGREGATE(15,3,(($A$2:$A$1840=$N$3)/($A$2:$A$1840=$N$3)*ROW($A$2:$A$1840))-ROW($A$1), ROWS($M$3:M259))), \"\")","v":""},{"$f":"IFERROR(R259/S259, \"\")","v":""}]
["0044","Louis F Angelo Elementary","00440065",null,"K - 05","SW",782,null,"ES",535,856,null,null,null,{"$f":"IFERROR((RANK(T260,$T$3:$T$191,0)+COUNTIF(T$3:T448, T260)-1), \"\")","v":""},{"$f":"IFERROR(INDEX($C$2:$C$1840,_xlfn.AGGREGATE(15,3,(($A$2:$A$1840=$N$3)/($A$2:$A$1840=$N$3)*ROW($A$2:$A$1840))-ROW($A$1), ROWS($M$3:M260))), \"\")","v":""},{"$f":"IFERROR(INDEX($B$2:$B$1840,_xlfn.AGGREGATE(15,3,(($A$2:$A$1840=$N$3)/($A$2:$A$1840=$N$3)*ROW($A$2:$A$1840))-ROW($A$1), ROWS($M$3:M260))), \"\")","v":""},null,{"$f":"IFERROR(INDEX($G$2:$G$1840,_xlfn.AGGREGATE(15,3,(($A$2:$A$1840=$N$3)/($A$2:$A$1840=$N$3)*ROW($A$2:$A$1840))-ROW($A$1), ROWS($M$3:M260))), \"\")","v":""},""]
["0044","Oscar F Raymond","00440078",null,"K - 05","SW",814,null,"ES",651,1041.6000000000001,null,null,null,{"$f":"IFERROR((RANK(T261,$T$3:$T$191,0)+COUNTIF(T$3:T449, T261)-1), \"\")","v":""},{"$f":"IFERROR(INDEX($C$2:$C$1840,_xlfn.AGGREGATE(15,3,(($A$2:$A$1840=$N$3)/($A$2:$A$1840=$N$3)*ROW($A$2:$A$1840))-ROW($A$1), ROWS($M$3:M261))), \"\")","v":""},{"$f":"IFERROR(INDEX($B$2:$B$1840,_xlfn.AGGREGATE(15,3,(($A$2:$A$1840=$N$3)/($A$2:$A$1840=$N$3)*ROW($A$2:$A$1840))-ROW($A$1), ROWS($M$3:M261))), \"\")","v":""},null,{"$f":"IFERROR(INDEX($G$2:$G$1840,_xlfn.AGGREGATE(15,3,(($A$2:$A$1840=$N$3)/($A$2:$A$1840=$N$3)*ROW($A$2:$A$1840))-ROW($A$1), ROWS($M$3:M261))), \"\")","v":""},""]
["0044","Frederick Douglass Academy","00440080",null,"07 - 12","NT",16,null,"MSHS/K-12",14,22.400000000000002,null,null,null,{"$f":"IFERROR((RANK(T262,$T$3:$T$191,0)+COUNTIF(T$3:T450, T262)-1), \"\")","v":""},{"$f":"IFERROR(INDEX($C$2:$C$1840,_xlfn.AGGREGATE(15,3,(($A$2:$A$1840=$N$3)/($A$2:$A$1840=$N$3)*ROW($A$2:$A$1840))-ROW($A$1), ROWS($M$3:M262))), \"\")","v":""},{"$f":"IFERROR(INDEX($B$2:$B$1840,_xlfn.AGGREGATE(15,3,(($A$2:$A$1840=$N$3)/($A$2:$A$1840=$N$3)*ROW($A$2:$A$1840))-ROW($A$1), ROWS($M$3:M262))), \"\")","v":""},null,{"$f":"IFERROR(INDEX($G$2:$G$1840,_xlfn.AGGREGATE(15,3,(($A$2:$A$1840=$N$3)/($A$2:$A$1840=$N$3)*ROW($A$2:$A$1840))-ROW($A$1), ROWS($M$3:M262))), \"\")","v":""},""]
["0044","Downey","00440110",null,"K - 05","SW",582,null,"ES",445,712,null,null,null,{"$f":"IFERROR((RANK(T263,$T$3:$T$191,0)+COUNTIF(T$3:T451, T263)-1), \"\")","v":""},{"$f":"IFERROR(INDEX($C$2:$C$1840,_xlfn.AGGREGATE(15,3,(($A$2:$A$1840=$N$3)/($A$2:$A$1840=$N$3)*ROW($A$2:$A$1840))-ROW($A$1), ROWS($M$3:M263))), \"\")","v":""},{"$f":"IFERROR(INDEX($B$2:$B$1840,_xlfn.AGGREGATE(15,3,(($A$2:$A$1840=$N$3)/($A$2:$A$1840=$N$3)*ROW($A$2:$A$1840))-ROW($A$1), ROWS($M$3:M263))), \"\")","v":""},null,{"$f":"IFERROR(INDEX($G$2:$G$1840,_xlfn.AGGREGATE(15,3,(($A$2:$A$1840=$N$3)/($A$2:$A$1840=$N$3)*ROW($A$2:$A$1840))-ROW($A$1), ROWS($M$3:M263))), \"\")","v":""},""]
["0044","Huntington Therapeutic Day School","00440400",null,"03 - 12","NT",63,null,"MSHS/K-12",58,92.800000000000011,null,null,null,{"$f":"IFERROR((RANK(T264,$T$3:$T$191,0)+COUNTIF(T$3:T452, T264)-1), \"\")","v":""},{"$f":"IFERROR(INDEX($C$2:$C$1840,_xlfn.AGGREGATE(15,3,(($A$2:$A$1840=$N$3)/($A$2:$A$1840=$N$3)*ROW($A$2:$A$1840))-ROW($A$1), ROWS($M$3:M264))), \"\")","v":""},{"$f":"IFERROR(INDEX($B$2:$B$1840,_xlfn.AGGREGATE(15,3,(($A$2:$A$1840=$N$3)/($A$2:$A$1840=$N$3)*ROW($A$2:$A$1840))-ROW($A$1), ROWS($M$3:M264))), \"\")","v":""},null,{"$f":"IFERROR(INDEX($G$2:$G$1840,_xlfn.AGGREGATE(15,3,(($A$2:$A$1840=$N$3)/($A$2:$A$1840=$N$3)*ROW($A$2:$A$1840))-ROW($A$1), ROWS($M$3:M264))), \"\")","v":""},""]
["0044","East Middle School","00440405",null,"06 - 08","NT",629,null,"MS",459,734.40000000000009,null,null,null,{"$f":"IFERROR((RANK(T265,$T$3:$T$191,0)+COUNTIF(T$3:T453, T265)-1), \"\")","v":""},{"$f":"IFERROR(INDEX($C$2:$C$1840,_xlfn.AGGREGATE(15,3,(($A$2:$A$1840=$N$3)/($A$2:$A$1840=$N$3)*ROW($A$2:$A$1840))-ROW($A$1), ROWS($M$3:M265))), \"\")","v":""},{"$f":"IFERROR(INDEX($B$2:$B$1840,_xlfn.AGGREGATE(15,3,(($A$2:$A$1840=$N$3)/($A$2:$A$1840=$N$3)*ROW($A$2:$A$1840))-ROW($A$1), ROWS($M$3:M265))), \"\")","v":""},null,{"$f":"IFERROR(INDEX($G$2:$G$1840,_xlfn.AGGREGATE(15,3,(($A$2:$A$1840=$N$3)/($A$2:$A$1840=$N$3)*ROW($A$2:$A$1840))-ROW($A$1), ROWS($M$3:M265))), \"\")","v":""},""]
["0044","North Middle School","00440410",null,"06","NT",193,null,"MS",155,248,null,null,null,{"$f":"IFERROR((RANK(T266,$T$3:$T$191,0)+COUNTIF(T$3:T454, T266)-1), \"\")","v":""},{"$f":"IFERROR(INDEX($C$2:$C$1840,_xlfn.AGGREGATE(15,3,(($A$2:$A$1840=$N$3)/($A$2:$A$1840=$N$3)*ROW($A$2:$A$1840))-ROW($A$1), ROWS($M$3:M266))), \"\")","v":""},{"$f":"IFERROR(INDEX($B$2:$B$1840,_xlfn.AGGREGATE(15,3,(($A$2:$A$1840=$N$3)/($A$2:$A$1840=$N$3)*ROW($A$2:$A$1840))-ROW($A$1), ROWS($M$3:M266))), \"\")","v":""},null,{"$f":"IFERROR(INDEX($G$2:$G$1840,_xlfn.AGGREGATE(15,3,(($A$2:$A$1840=$N$3)/($A$2:$A$1840=$N$3)*ROW($A$2:$A$1840))-ROW($A$1), ROWS($M$3:M266))), \"\")","v":""},""]
["0044","South Middle School","00440415",null,"06 - 08","NT",563,null,"MS",382,611.20000000000005,null,null,null,{"$f":"IFERROR((RANK(T267,$T$3:$T$191,0)+COUNTIF(T$3:T455, T267)-1), \"\")","v":""},{"$f":"IFERROR(INDEX($C$2:$C$1840,_xlfn.AGGREGATE(15,3,(($A$2:$A$1840=$N$3)/($A$2:$A$1840=$N$3)*ROW($A$2:$A$1840))-ROW($A$1), ROWS($M$3:M267))), \"\")","v":""},{"$f":"IFERROR(INDEX($B$2:$B$1840,_xlfn.AGGREGATE(15,3,(($A$2:$A$1840=$N$3)/($A$2:$A$1840=$N$3)*ROW($A$2:$A$1840))-ROW($A$1), ROWS($M$3:M267))), \"\")","v":""},null,{"$f":"IFERROR(INDEX($G$2:$G$1840,_xlfn.AGGREGATE(15,3,(($A$2:$A$1840=$N$3)/($A$2:$A$1840=$N$3)*ROW($A$2:$A$1840))-ROW($A$1), ROWS($M$3:M267))), \"\")","v":""},""]
["0044","West Middle School","00440420",null,"06 - 08","NT",662,null,"MS",420,672,null,null,null,{"$f":"IFERROR((RANK(T268,$T$3:$T$191,0)+COUNTIF(T$3:T456, T268)-1), \"\")","v":""},{"$f":"IFERROR(INDEX($C$2:$C$1840,_xlfn.AGGREGATE(15,3,(($A$2:$A$1840=$N$3)/($A$2:$A$1840=$N$3)*ROW($A$2:$A$1840))-ROW($A$1), ROWS($M$3:M268))), \"\")","v":""},{"$f":"IFERROR(INDEX($B$2:$B$1840,_xlfn.AGGREGATE(15,3,(($A$2:$A$1840=$N$3)/($A$2:$A$1840=$N$3)*ROW($A$2:$A$1840))-ROW($A$1), ROWS($M$3:M268))), \"\")","v":""},null,{"$f":"IFERROR(INDEX($G$2:$G$1840,_xlfn.AGGREGATE(15,3,(($A$2:$A$1840=$N$3)/($A$2:$A$1840=$N$3)*ROW($A$2:$A$1840))-ROW($A$1), ROWS($M$3:M268))), \"\")","v":""},""]
["0044","Ashfield Middle School","00440421",null,"06 - 08","NT",556,null,"MS",326,521.6,null,null,null,{"$f":"IFERROR((RANK(T269,$T$3:$T$191,0)+COUNTIF(T$3:T457, T269)-1), \"\")","v":""},{"$f":"IFERROR(INDEX($C$2:$C$1840,_xlfn.AGGREGATE(15,3,(($A$2:$A$1840=$N$3)/($A$2:$A$1840=$N$3)*ROW($A$2:$A$1840))-ROW($A$1), ROWS($M$3:M269))), \"\")","v":""},{"$f":"IFERROR(INDEX($B$2:$B$1840,_xlfn.AGGREGATE(15,3,(($A$2:$A$1840=$N$3)/($A$2:$A$1840=$N$3)*ROW($A$2:$A$1840))-ROW($A$1), ROWS($M$3:M269))), \"\")","v":""},null,{"$f":"IFERROR(INDEX($G$2:$G$1840,_xlfn.AGGREGATE(15,3,(($A$2:$A$1840=$N$3)/($A$2:$A$1840=$N$3)*ROW($A$2:$A$1840))-ROW($A$1), ROWS($M$3:M269))), \"\")","v":""},""]
["0044","Joseph F. Plouffe Academy","00440422",null,"06 - 08","NT",741,null,"MS",426,681.6,null,null,null,{"$f":"IFERROR((RANK(T270,$T$3:$T$191,0)+COUNTIF(T$3:T458, T270)-1), \"\")","v":""},{"$f":"IFERROR(INDEX($C$2:$C$1840,_xlfn.AGGREGATE(15,3,(($A$2:$A$1840=$N$3)/($A$2:$A$1840=$N$3)*ROW($A$2:$A$1840))-ROW($A$1), ROWS($M$3:M270))), \"\")","v":""},{"$f":"IFERROR(INDEX($B$2:$B$1840,_xlfn.AGGREGATE(15,3,(($A$2:$A$1840=$N$3)/($A$2:$A$1840=$N$3)*ROW($A$2:$A$1840))-ROW($A$1), ROWS($M$3:M270))), \"\")","v":""},null,{"$f":"IFERROR(INDEX($G$2:$G$1840,_xlfn.AGGREGATE(15,3,(($A$2:$A$1840=$N$3)/($A$2:$A$1840=$N$3)*ROW($A$2:$A$1840))-ROW($A$1), ROWS($M$3:M270))), \"\")","v":""},""]
["0044","Brockton High","00440505",null,"09 - 12","NT",3903,null,"HS",2381,3769.6000000000004,null,null,null,{"$f":"IFERROR((RANK(T271,$T$3:$T$191,0)+COUNTIF(T$3:T459, T271)-1), \"\")","v":""},{"$f":"IFERROR(INDEX($C$2:$C$1840,_xlfn.AGGREGATE(15,3,(($A$2:$A$1840=$N$3)/($A$2:$A$1840=$N$3)*ROW($A$2:$A$1840))-ROW($A$1), ROWS($M$3:M271))), \"\")","v":""},{"$f":"IFERROR(INDEX($B$2:$B$1840,_xlfn.AGGREGATE(15,3,(($A$2:$A$1840=$N$3)/($A$2:$A$1840=$N$3)*ROW($A$2:$A$1840))-ROW($A$1), ROWS($M$3:M271))), \"\")","v":""},null,{"$f":"IFERROR(INDEX($G$2:$G$1840,_xlfn.AGGREGATE(15,3,(($A$2:$A$1840=$N$3)/($A$2:$A$1840=$N$3)*ROW($A$2:$A$1840))-ROW($A$1), ROWS($M$3:M271))), \"\")","v":""},""]
["0044","Brockton Champion High School","00440515",null,"09 - 12","NT",103,null,"HS",80,102.4,null,null,null,{"$f":"IFERROR((RANK(T272,$T$3:$T$191,0)+COUNTIF(T$3:T460, T272)-1), \"\")","v":""},{"$f":"IFERROR(INDEX($C$2:$C$1840,_xlfn.AGGREGATE(15,3,(($A$2:$A$1840=$N$3)/($A$2:$A$1840=$N$3)*ROW($A$2:$A$1840))-ROW($A$1), ROWS($M$3:M272))), \"\")","v":""},{"$f":"IFERROR(INDEX($B$2:$B$1840,_xlfn.AGGREGATE(15,3,(($A$2:$A$1840=$N$3)/($A$2:$A$1840=$N$3)*ROW($A$2:$A$1840))-ROW($A$1), ROWS($M$3:M272))), \"\")","v":""},null,{"$f":"IFERROR(INDEX($G$2:$G$1840,_xlfn.AGGREGATE(15,3,(($A$2:$A$1840=$N$3)/($A$2:$A$1840=$N$3)*ROW($A$2:$A$1840))-ROW($A$1), ROWS($M$3:M272))), \"\")","v":""},""]
["0044","Edison Academy","00440520",null,"09 - 12","NT",284,null,"HS",196,313.60000000000002,null,null,null,{"$f":"IFERROR((RANK(T273,$T$3:$T$191,0)+COUNTIF(T$3:T461, T273)-1), \"\")","v":""},{"$f":"IFERROR(INDEX($C$2:$C$1840,_xlfn.AGGREGATE(15,3,(($A$2:$A$1840=$N$3)/($A$2:$A$1840=$N$3)*ROW($A$2:$A$1840))-ROW($A$1), ROWS($M$3:M273))), \"\")","v":""},{"$f":"IFERROR(INDEX($B$2:$B$1840,_xlfn.AGGREGATE(15,3,(($A$2:$A$1840=$N$3)/($A$2:$A$1840=$N$3)*ROW($A$2:$A$1840))-ROW($A$1), ROWS($M$3:M273))), \"\")","v":""},null,{"$f":"IFERROR(INDEX($G$2:$G$1840,_xlfn.AGGREGATE(15,3,(($A$2:$A$1840=$N$3)/($A$2:$A$1840=$N$3)*ROW($A$2:$A$1840))-ROW($A$1), ROWS($M$3:M273))), \"\")","v":""},""]
["0045","Brookfield Elementary","00450005",null,"PK - 06","TA",264,null,"ES",87,134.4,null,null,null,{"$f":"IFERROR((RANK(T274,$T$3:$T$191,0)+COUNTIF(T$3:T462, T274)-1), \"\")","v":""},{"$f":"IFERROR(INDEX($C$2:$C$1840,_xlfn.AGGREGATE(15,3,(($A$2:$A$1840=$N$3)/($A$2:$A$1840=$N$3)*ROW($A$2:$A$1840))-ROW($A$1), ROWS($M$3:M274))), \"\")","v":""},{"$f":"IFERROR(INDEX($B$2:$B$1840,_xlfn.AGGREGATE(15,3,(($A$2:$A$1840=$N$3)/($A$2:$A$1840=$N$3)*ROW($A$2:$A$1840))-ROW($A$1), ROWS($M$3:M274))), \"\")","v":""},null,{"$f":"IFERROR(INDEX($G$2:$G$1840,_xlfn.AGGREGATE(15,3,(($A$2:$A$1840=$N$3)/($A$2:$A$1840=$N$3)*ROW($A$2:$A$1840))-ROW($A$1), ROWS($M$3:M274))), \"\")","v":""},""]
["0046","Brookline Early Education Program at Beacon","00460001",null,"PK","NT",36,null,"EES",2,0,null,null,null,{"$f":"IFERROR((RANK(T275,$T$3:$T$191,0)+COUNTIF(T$3:T463, T275)-1), \"\")","v":""},{"$f":"IFERROR(INDEX($C$2:$C$1840,_xlfn.AGGREGATE(15,3,(($A$2:$A$1840=$N$3)/($A$2:$A$1840=$N$3)*ROW($A$2:$A$1840))-ROW($A$1), ROWS($M$3:M275))), \"\")","v":""},{"$f":"IFERROR(INDEX($B$2:$B$1840,_xlfn.AGGREGATE(15,3,(($A$2:$A$1840=$N$3)/($A$2:$A$1840=$N$3)*ROW($A$2:$A$1840))-ROW($A$1), ROWS($M$3:M275))), \"\")","v":""},null,{"$f":"IFERROR(INDEX($G$2:$G$1840,_xlfn.AGGREGATE(15,3,(($A$2:$A$1840=$N$3)/($A$2:$A$1840=$N$3)*ROW($A$2:$A$1840))-ROW($A$1), ROWS($M$3:M275))), \"\")","v":""},""]
["0046","Brookline Early Education Program at Putterham","00460002",null,"PK","NT",38,null,"EES",5,0,null,null,null,{"$f":"IFERROR((RANK(T276,$T$3:$T$191,0)+COUNTIF(T$3:T464, T276)-1), \"\")","v":""},{"$f":"IFERROR(INDEX($C$2:$C$1840,_xlfn.AGGREGATE(15,3,(($A$2:$A$1840=$N$3)/($A$2:$A$1840=$N$3)*ROW($A$2:$A$1840))-ROW($A$1), ROWS($M$3:M276))), \"\")","v":""},{"$f":"IFERROR(INDEX($B$2:$B$1840,_xlfn.AGGREGATE(15,3,(($A$2:$A$1840=$N$3)/($A$2:$A$1840=$N$3)*ROW($A$2:$A$1840))-ROW($A$1), ROWS($M$3:M276))), \"\")","v":""},null,{"$f":"IFERROR(INDEX($G$2:$G$1840,_xlfn.AGGREGATE(15,3,(($A$2:$A$1840=$N$3)/($A$2:$A$1840=$N$3)*ROW($A$2:$A$1840))-ROW($A$1), ROWS($M$3:M276))), \"\")","v":""},""]
["0046","Brookline Early Education Program at Clark Road","00460003",null,"PK","NT",38,null,"EES",4,0,null,null,null,{"$f":"IFERROR((RANK(T277,$T$3:$T$191,0)+COUNTIF(T$3:T465, T277)-1), \"\")","v":""},{"$f":"IFERROR(INDEX($C$2:$C$1840,_xlfn.AGGREGATE(15,3,(($A$2:$A$1840=$N$3)/($A$2:$A$1840=$N$3)*ROW($A$2:$A$1840))-ROW($A$1), ROWS($M$3:M277))), \"\")","v":""},{"$f":"IFERROR(INDEX($B$2:$B$1840,_xlfn.AGGREGATE(15,3,(($A$2:$A$1840=$N$3)/($A$2:$A$1840=$N$3)*ROW($A$2:$A$1840))-ROW($A$1), ROWS($M$3:M277))), \"\")","v":""},null,{"$f":"IFERROR(INDEX($G$2:$G$1840,_xlfn.AGGREGATE(15,3,(($A$2:$A$1840=$N$3)/($A$2:$A$1840=$N$3)*ROW($A$2:$A$1840))-ROW($A$1), ROWS($M$3:M277))), \"\")","v":""},""]
["0046","Edith C Baker","00460005",null,"K - 08","NT",623,null,"ESMS",50,80,null,null,null,{"$f":"IFERROR((RANK(T278,$T$3:$T$191,0)+COUNTIF(T$3:T466, T278)-1), \"\")","v":""},{"$f":"IFERROR(INDEX($C$2:$C$1840,_xlfn.AGGREGATE(15,3,(($A$2:$A$1840=$N$3)/($A$2:$A$1840=$N$3)*ROW($A$2:$A$1840))-ROW($A$1), ROWS($M$3:M278))), \"\")","v":""},{"$f":"IFERROR(INDEX($B$2:$B$1840,_xlfn.AGGREGATE(15,3,(($A$2:$A$1840=$N$3)/($A$2:$A$1840=$N$3)*ROW($A$2:$A$1840))-ROW($A$1), ROWS($M$3:M278))), \"\")","v":""},null,{"$f":"IFERROR(INDEX($G$2:$G$1840,_xlfn.AGGREGATE(15,3,(($A$2:$A$1840=$N$3)/($A$2:$A$1840=$N$3)*ROW($A$2:$A$1840))-ROW($A$1), ROWS($M$3:M278))), \"\")","v":""},""]
["0046","Florida Ruffin Ridley School","00460015",null,"PK - 08","TA",802,null,"ESMS",127,201.60000000000002,null,null,null,{"$f":"IFERROR((RANK(T279,$T$3:$T$191,0)+COUNTIF(T$3:T467, T279)-1), \"\")","v":""},{"$f":"IFERROR(INDEX($C$2:$C$1840,_xlfn.AGGREGATE(15,3,(($A$2:$A$1840=$N$3)/($A$2:$A$1840=$N$3)*ROW($A$2:$A$1840))-ROW($A$1), ROWS($M$3:M279))), \"\")","v":""},{"$f":"IFERROR(INDEX($B$2:$B$1840,_xlfn.AGGREGATE(15,3,(($A$2:$A$1840=$N$3)/($A$2:$A$1840=$N$3)*ROW($A$2:$A$1840))-ROW($A$1), ROWS($M$3:M279))), \"\")","v":""},null,{"$f":"IFERROR(INDEX($G$2:$G$1840,_xlfn.AGGREGATE(15,3,(($A$2:$A$1840=$N$3)/($A$2:$A$1840=$N$3)*ROW($A$2:$A$1840))-ROW($A$1), ROWS($M$3:M279))), \"\")","v":""},""]
["0046","Michael Driscoll","00460020",null,"K - 08","NT",475,null,"ESMS",29,46.400000000000006,null,null,null,{"$f":"IFERROR((RANK(T280,$T$3:$T$191,0)+COUNTIF(T$3:T468, T280)-1), \"\")","v":""},{"$f":"IFERROR(INDEX($C$2:$C$1840,_xlfn.AGGREGATE(15,3,(($A$2:$A$1840=$N$3)/($A$2:$A$1840=$N$3)*ROW($A$2:$A$1840))-ROW($A$1), ROWS($M$3:M280))), \"\")","v":""},{"$f":"IFERROR(INDEX($B$2:$B$1840,_xlfn.AGGREGATE(15,3,(($A$2:$A$1840=$N$3)/($A$2:$A$1840=$N$3)*ROW($A$2:$A$1840))-ROW($A$1), ROWS($M$3:M280))), \"\")","v":""},null,{"$f":"IFERROR(INDEX($G$2:$G$1840,_xlfn.AGGREGATE(15,3,(($A$2:$A$1840=$N$3)/($A$2:$A$1840=$N$3)*ROW($A$2:$A$1840))-ROW($A$1), ROWS($M$3:M280))), \"\")","v":""},""]
["0046","Heath","00460025",null,"PK - 08","NT",478,null,"ESMS",28,44.800000000000004,null,null,null,{"$f":"IFERROR((RANK(T281,$T$3:$T$191,0)+COUNTIF(T$3:T469, T281)-1), \"\")","v":""},{"$f":"IFERROR(INDEX($C$2:$C$1840,_xlfn.AGGREGATE(15,3,(($A$2:$A$1840=$N$3)/($A$2:$A$1840=$N$3)*ROW($A$2:$A$1840))-ROW($A$1), ROWS($M$3:M281))), \"\")","v":""},{"$f":"IFERROR(INDEX($B$2:$B$1840,_xlfn.AGGREGATE(15,3,(($A$2:$A$1840=$N$3)/($A$2:$A$1840=$N$3)*ROW($A$2:$A$1840))-ROW($A$1), ROWS($M$3:M281))), \"\")","v":""},null,{"$f":"IFERROR(INDEX($G$2:$G$1840,_xlfn.AGGREGATE(15,3,(($A$2:$A$1840=$N$3)/($A$2:$A$1840=$N$3)*ROW($A$2:$A$1840))-ROW($A$1), ROWS($M$3:M281))), \"\")","v":""},""]
["0046","Lawrence","00460030",null,"K - 08","NT",577,null,"ESMS",64,102.4,null,null,null,{"$f":"IFERROR((RANK(T282,$T$3:$T$191,0)+COUNTIF(T$3:T470, T282)-1), \"\")","v":""},{"$f":"IFERROR(INDEX($C$2:$C$1840,_xlfn.AGGREGATE(15,3,(($A$2:$A$1840=$N$3)/($A$2:$A$1840=$N$3)*ROW($A$2:$A$1840))-ROW($A$1), ROWS($M$3:M282))), \"\")","v":""},{"$f":"IFERROR(INDEX($B$2:$B$1840,_xlfn.AGGREGATE(15,3,(($A$2:$A$1840=$N$3)/($A$2:$A$1840=$N$3)*ROW($A$2:$A$1840))-ROW($A$1), ROWS($M$3:M282))), \"\")","v":""},null,{"$f":"IFERROR(INDEX($G$2:$G$1840,_xlfn.AGGREGATE(15,3,(($A$2:$A$1840=$N$3)/($A$2:$A$1840=$N$3)*ROW($A$2:$A$1840))-ROW($A$1), ROWS($M$3:M282))), \"\")","v":""},""]
["0046","William H Lincoln","00460035",null,"K - 08","TA",504,null,"ESMS",79,126.4,null,null,null,{"$f":"IFERROR((RANK(T283,$T$3:$T$191,0)+COUNTIF(T$3:T471, T283)-1), \"\")","v":""},{"$f":"IFERROR(INDEX($C$2:$C$1840,_xlfn.AGGREGATE(15,3,(($A$2:$A$1840=$N$3)/($A$2:$A$1840=$N$3)*ROW($A$2:$A$1840))-ROW($A$1), ROWS($M$3:M283))), \"\")","v":""},{"$f":"IFERROR(INDEX($B$2:$B$1840,_xlfn.AGGREGATE(15,3,(($A$2:$A$1840=$N$3)/($A$2:$A$1840=$N$3)*ROW($A$2:$A$1840))-ROW($A$1), ROWS($M$3:M283))), \"\")","v":""},null,{"$f":"IFERROR(INDEX($G$2:$G$1840,_xlfn.AGGREGATE(15,3,(($A$2:$A$1840=$N$3)/($A$2:$A$1840=$N$3)*ROW($A$2:$A$1840))-ROW($A$1), ROWS($M$3:M283))), \"\")","v":""},""]
["0046","Pierce","00460040",null,"K - 08","NT",683,null,"ESMS",68,108.80000000000001,null,null,null,{"$f":"IFERROR((RANK(T284,$T$3:$T$191,0)+COUNTIF(T$3:T472, T284)-1), \"\")","v":""},{"$f":"IFERROR(INDEX($C$2:$C$1840,_xlfn.AGGREGATE(15,3,(($A$2:$A$1840=$N$3)/($A$2:$A$1840=$N$3)*ROW($A$2:$A$1840))-ROW($A$1), ROWS($M$3:M284))), \"\")","v":""},{"$f":"IFERROR(INDEX($B$2:$B$1840,_xlfn.AGGREGATE(15,3,(($A$2:$A$1840=$N$3)/($A$2:$A$1840=$N$3)*ROW($A$2:$A$1840))-ROW($A$1), ROWS($M$3:M284))), \"\")","v":""},null,{"$f":"IFERROR(INDEX($G$2:$G$1840,_xlfn.AGGREGATE(15,3,(($A$2:$A$1840=$N$3)/($A$2:$A$1840=$N$3)*ROW($A$2:$A$1840))-ROW($A$1), ROWS($M$3:M284))), \"\")","v":""},""]
["0046","John D Runkle","00460045",null,"PK - 08","NT",495,null,"ESMS",49,76.800000000000011,null,null,null,{"$f":"IFERROR((RANK(T285,$T$3:$T$191,0)+COUNTIF(T$3:T473, T285)-1), \"\")","v":""},{"$f":"IFERROR(INDEX($C$2:$C$1840,_xlfn.AGGREGATE(15,3,(($A$2:$A$1840=$N$3)/($A$2:$A$1840=$N$3)*ROW($A$2:$A$1840))-ROW($A$1), ROWS($M$3:M285))), \"\")","v":""},{"$f":"IFERROR(INDEX($B$2:$B$1840,_xlfn.AGGREGATE(15,3,(($A$2:$A$1840=$N$3)/($A$2:$A$1840=$N$3)*ROW($A$2:$A$1840))-ROW($A$1), ROWS($M$3:M285))), \"\")","v":""},null,{"$f":"IFERROR(INDEX($G$2:$G$1840,_xlfn.AGGREGATE(15,3,(($A$2:$A$1840=$N$3)/($A$2:$A$1840=$N$3)*ROW($A$2:$A$1840))-ROW($A$1), ROWS($M$3:M285))), \"\")","v":""},""]
["0046","The Lynch Center","00460060",null,"PK","NT",36,null,"EES",11,0,null,null,null,{"$f":"IFERROR((RANK(T286,$T$3:$T$191,0)+COUNTIF(T$3:T474, T286)-1), \"\")","v":""},{"$f":"IFERROR(INDEX($C$2:$C$1840,_xlfn.AGGREGATE(15,3,(($A$2:$A$1840=$N$3)/($A$2:$A$1840=$N$3)*ROW($A$2:$A$1840))-ROW($A$1), ROWS($M$3:M286))), \"\")","v":""},{"$f":"IFERROR(INDEX($B$2:$B$1840,_xlfn.AGGREGATE(15,3,(($A$2:$A$1840=$N$3)/($A$2:$A$1840=$N$3)*ROW($A$2:$A$1840))-ROW($A$1), ROWS($M$3:M286))), \"\")","v":""},null,{"$f":"IFERROR(INDEX($G$2:$G$1840,_xlfn.AGGREGATE(15,3,(($A$2:$A$1840=$N$3)/($A$2:$A$1840=$N$3)*ROW($A$2:$A$1840))-ROW($A$1), ROWS($M$3:M286))), \"\")","v":""},""]
["0046","Brookline High","00460505",null,"09 - 12","NT",2026,null,"HS",270,419.20000000000005,null,null,null,{"$f":"IFERROR((RANK(T287,$T$3:$T$191,0)+COUNTIF(T$3:T475, T287)-1), \"\")","v":""},{"$f":"IFERROR(INDEX($C$2:$C$1840,_xlfn.AGGREGATE(15,3,(($A$2:$A$1840=$N$3)/($A$2:$A$1840=$N$3)*ROW($A$2:$A$1840))-ROW($A$1), ROWS($M$3:M287))), \"\")","v":""},{"$f":"IFERROR(INDEX($B$2:$B$1840,_xlfn.AGGREGATE(15,3,(($A$2:$A$1840=$N$3)/($A$2:$A$1840=$N$3)*ROW($A$2:$A$1840))-ROW($A$1), ROWS($M$3:M287))), \"\")","v":""},null,{"$f":"IFERROR(INDEX($G$2:$G$1840,_xlfn.AGGREGATE(15,3,(($A$2:$A$1840=$N$3)/($A$2:$A$1840=$N$3)*ROW($A$2:$A$1840))-ROW($A$1), ROWS($M$3:M287))), \"\")","v":""},""]
["0048","Fox Hill","00480007",null,"K - 05","NT",447,null,"ES",79,126.4,null,null,null,{"$f":"IFERROR((RANK(T288,$T$3:$T$191,0)+COUNTIF(T$3:T476, T288)-1), \"\")","v":""},{"$f":"IFERROR(INDEX($C$2:$C$1840,_xlfn.AGGREGATE(15,3,(($A$2:$A$1840=$N$3)/($A$2:$A$1840=$N$3)*ROW($A$2:$A$1840))-ROW($A$1), ROWS($M$3:M288))), \"\")","v":""},{"$f":"IFERROR(INDEX($B$2:$B$1840,_xlfn.AGGREGATE(15,3,(($A$2:$A$1840=$N$3)/($A$2:$A$1840=$N$3)*ROW($A$2:$A$1840))-ROW($A$1), ROWS($M$3:M288))), \"\")","v":""},null,{"$f":"IFERROR(INDEX($G$2:$G$1840,_xlfn.AGGREGATE(15,3,(($A$2:$A$1840=$N$3)/($A$2:$A$1840=$N$3)*ROW($A$2:$A$1840))-ROW($A$1), ROWS($M$3:M288))), \"\")","v":""},""]
["0048","Memorial","00480015",null,"K - 05","TA",393,null,"ES",73,116.80000000000001,null,null,null,{"$f":"IFERROR((RANK(T289,$T$3:$T$191,0)+COUNTIF(T$3:T477, T289)-1), \"\")","v":""},{"$f":"IFERROR(INDEX($C$2:$C$1840,_xlfn.AGGREGATE(15,3,(($A$2:$A$1840=$N$3)/($A$2:$A$1840=$N$3)*ROW($A$2:$A$1840))-ROW($A$1), ROWS($M$3:M289))), \"\")","v":""},{"$f":"IFERROR(INDEX($B$2:$B$1840,_xlfn.AGGREGATE(15,3,(($A$2:$A$1840=$N$3)/($A$2:$A$1840=$N$3)*ROW($A$2:$A$1840))-ROW($A$1), ROWS($M$3:M289))), \"\")","v":""},null,{"$f":"IFERROR(INDEX($G$2:$G$1840,_xlfn.AGGREGATE(15,3,(($A$2:$A$1840=$N$3)/($A$2:$A$1840=$N$3)*ROW($A$2:$A$1840))-ROW($A$1), ROWS($M$3:M289))), \"\")","v":""},""]
["0048","Pine Glen Elementary","00480020",null,"K - 05","NT",311,null,"ES",45,72,null,null,null,{"$f":"IFERROR((RANK(T290,$T$3:$T$191,0)+COUNTIF(T$3:T478, T290)-1), \"\")","v":""},{"$f":"IFERROR(INDEX($C$2:$C$1840,_xlfn.AGGREGATE(15,3,(($A$2:$A$1840=$N$3)/($A$2:$A$1840=$N$3)*ROW($A$2:$A$1840))-ROW($A$1), ROWS($M$3:M290))), \"\")","v":""},{"$f":"IFERROR(INDEX($B$2:$B$1840,_xlfn.AGGREGATE(15,3,(($A$2:$A$1840=$N$3)/($A$2:$A$1840=$N$3)*ROW($A$2:$A$1840))-ROW($A$1), ROWS($M$3:M290))), \"\")","v":""},null,{"$f":"IFERROR(INDEX($G$2:$G$1840,_xlfn.AGGREGATE(15,3,(($A$2:$A$1840=$N$3)/($A$2:$A$1840=$N$3)*ROW($A$2:$A$1840))-ROW($A$1), ROWS($M$3:M290))), \"\")","v":""},""]
["0048","Francis Wyman Elementary","00480035",null,"K - 05","TA",512,null,"ES",87,139.20000000000002,null,null,null,{"$f":"IFERROR((RANK(T291,$T$3:$T$191,0)+COUNTIF(T$3:T479, T291)-1), \"\")","v":""},{"$f":"IFERROR(INDEX($C$2:$C$1840,_xlfn.AGGREGATE(15,3,(($A$2:$A$1840=$N$3)/($A$2:$A$1840=$N$3)*ROW($A$2:$A$1840))-ROW($A$1), ROWS($M$3:M291))), \"\")","v":""},{"$f":"IFERROR(INDEX($B$2:$B$1840,_xlfn.AGGREGATE(15,3,(($A$2:$A$1840=$N$3)/($A$2:$A$1840=$N$3)*ROW($A$2:$A$1840))-ROW($A$1), ROWS($M$3:M291))), \"\")","v":""},null,{"$f":"IFERROR(INDEX($G$2:$G$1840,_xlfn.AGGREGATE(15,3,(($A$2:$A$1840=$N$3)/($A$2:$A$1840=$N$3)*ROW($A$2:$A$1840))-ROW($A$1), ROWS($M$3:M291))), \"\")","v":""},""]
["0048","Marshall Simonds Middle","00480303",null,"06 - 08","NT",754,null,"MS",106,169.60000000000002,null,null,null,{"$f":"IFERROR((RANK(T292,$T$3:$T$191,0)+COUNTIF(T$3:T480, T292)-1), \"\")","v":""},{"$f":"IFERROR(INDEX($C$2:$C$1840,_xlfn.AGGREGATE(15,3,(($A$2:$A$1840=$N$3)/($A$2:$A$1840=$N$3)*ROW($A$2:$A$1840))-ROW($A$1), ROWS($M$3:M292))), \"\")","v":""},{"$f":"IFERROR(INDEX($B$2:$B$1840,_xlfn.AGGREGATE(15,3,(($A$2:$A$1840=$N$3)/($A$2:$A$1840=$N$3)*ROW($A$2:$A$1840))-ROW($A$1), ROWS($M$3:M292))), \"\")","v":""},null,{"$f":"IFERROR(INDEX($G$2:$G$1840,_xlfn.AGGREGATE(15,3,(($A$2:$A$1840=$N$3)/($A$2:$A$1840=$N$3)*ROW($A$2:$A$1840))-ROW($A$1), ROWS($M$3:M292))), \"\")","v":""},""]
["0048","Burlington High","00480505",null,"PK,09 - 12","NT",972,null,"HS",157,228.8,null,null,null,{"$f":"IFERROR((RANK(T293,$T$3:$T$191,0)+COUNTIF(T$3:T481, T293)-1), \"\")","v":""},{"$f":"IFERROR(INDEX($C$2:$C$1840,_xlfn.AGGREGATE(15,3,(($A$2:$A$1840=$N$3)/($A$2:$A$1840=$N$3)*ROW($A$2:$A$1840))-ROW($A$1), ROWS($M$3:M293))), \"\")","v":""},{"$f":"IFERROR(INDEX($B$2:$B$1840,_xlfn.AGGREGATE(15,3,(($A$2:$A$1840=$N$3)/($A$2:$A$1840=$N$3)*ROW($A$2:$A$1840))-ROW($A$1), ROWS($M$3:M293))), \"\")","v":""},null,{"$f":"IFERROR(INDEX($G$2:$G$1840,_xlfn.AGGREGATE(15,3,(($A$2:$A$1840=$N$3)/($A$2:$A$1840=$N$3)*ROW($A$2:$A$1840))-ROW($A$1), ROWS($M$3:M293))), \"\")","v":""},""]
["0049","Maria L. Baldwin","00490005",null,"PK - 05","NT",344,null,"ES",71,89.600000000000009,null,null,null,{"$f":"IFERROR((RANK(T294,$T$3:$T$191,0)+COUNTIF(T$3:T482, T294)-1), \"\")","v":""},{"$f":"IFERROR(INDEX($C$2:$C$1840,_xlfn.AGGREGATE(15,3,(($A$2:$A$1840=$N$3)/($A$2:$A$1840=$N$3)*ROW($A$2:$A$1840))-ROW($A$1), ROWS($M$3:M294))), \"\")","v":""},{"$f":"IFERROR(INDEX($B$2:$B$1840,_xlfn.AGGREGATE(15,3,(($A$2:$A$1840=$N$3)/($A$2:$A$1840=$N$3)*ROW($A$2:$A$1840))-ROW($A$1), ROWS($M$3:M294))), \"\")","v":""},null,{"$f":"IFERROR(INDEX($G$2:$G$1840,_xlfn.AGGREGATE(15,3,(($A$2:$A$1840=$N$3)/($A$2:$A$1840=$N$3)*ROW($A$2:$A$1840))-ROW($A$1), ROWS($M$3:M294))), \"\")","v":""},""]
["0049","Amigos School","00490006",null,"PK - 08","NT",407,null,"ESMS",86,132.80000000000001,null,null,null,{"$f":"IFERROR((RANK(T295,$T$3:$T$191,0)+COUNTIF(T$3:T483, T295)-1), \"\")","v":""},{"$f":"IFERROR(INDEX($C$2:$C$1840,_xlfn.AGGREGATE(15,3,(($A$2:$A$1840=$N$3)/($A$2:$A$1840=$N$3)*ROW($A$2:$A$1840))-ROW($A$1), ROWS($M$3:M295))), \"\")","v":""},{"$f":"IFERROR(INDEX($B$2:$B$1840,_xlfn.AGGREGATE(15,3,(($A$2:$A$1840=$N$3)/($A$2:$A$1840=$N$3)*ROW($A$2:$A$1840))-ROW($A$1), ROWS($M$3:M295))), \"\")","v":""},null,{"$f":"IFERROR(INDEX($G$2:$G$1840,_xlfn.AGGREGATE(15,3,(($A$2:$A$1840=$N$3)/($A$2:$A$1840=$N$3)*ROW($A$2:$A$1840))-ROW($A$1), ROWS($M$3:M295))), \"\")","v":""},""]
["0049","Cambridgeport","00490007",null,"PK - 05","NT",269,null,"ES",61,92.800000000000011,null,null,null,{"$f":"IFERROR((RANK(T296,$T$3:$T$191,0)+COUNTIF(T$3:T484, T296)-1), \"\")","v":""},{"$f":"IFERROR(INDEX($C$2:$C$1840,_xlfn.AGGREGATE(15,3,(($A$2:$A$1840=$N$3)/($A$2:$A$1840=$N$3)*ROW($A$2:$A$1840))-ROW($A$1), ROWS($M$3:M296))), \"\")","v":""},{"$f":"IFERROR(INDEX($B$2:$B$1840,_xlfn.AGGREGATE(15,3,(($A$2:$A$1840=$N$3)/($A$2:$A$1840=$N$3)*ROW($A$2:$A$1840))-ROW($A$1), ROWS($M$3:M296))), \"\")","v":""},null,{"$f":"IFERROR(INDEX($G$2:$G$1840,_xlfn.AGGREGATE(15,3,(($A$2:$A$1840=$N$3)/($A$2:$A$1840=$N$3)*ROW($A$2:$A$1840))-ROW($A$1), ROWS($M$3:M296))), \"\")","v":""},""]
["0049","Haggerty","00490020",null,"PK - 05","NT",241,null,"ES",65,94.4,null,null,null,{"$f":"IFERROR((RANK(T297,$T$3:$T$191,0)+COUNTIF(T$3:T485, T297)-1), \"\")","v":""},{"$f":"IFERROR(INDEX($C$2:$C$1840,_xlfn.AGGREGATE(15,3,(($A$2:$A$1840=$N$3)/($A$2:$A$1840=$N$3)*ROW($A$2:$A$1840))-ROW($A$1), ROWS($M$3:M297))), \"\")","v":""},{"$f":"IFERROR(INDEX($B$2:$B$1840,_xlfn.AGGREGATE(15,3,(($A$2:$A$1840=$N$3)/($A$2:$A$1840=$N$3)*ROW($A$2:$A$1840))-ROW($A$1), ROWS($M$3:M297))), \"\")","v":""},null,{"$f":"IFERROR(INDEX($G$2:$G$1840,_xlfn.AGGREGATE(15,3,(($A$2:$A$1840=$N$3)/($A$2:$A$1840=$N$3)*ROW($A$2:$A$1840))-ROW($A$1), ROWS($M$3:M297))), \"\")","v":""},""]
["0049","Martin Luther King Jr.","00490030",null,"PK - 05","NT",288,null,"ES",58,86.4,null,null,null,{"$f":"IFERROR((RANK(T298,$T$3:$T$191,0)+COUNTIF(T$3:T486, T298)-1), \"\")","v":""},{"$f":"IFERROR(INDEX($C$2:$C$1840,_xlfn.AGGREGATE(15,3,(($A$2:$A$1840=$N$3)/($A$2:$A$1840=$N$3)*ROW($A$2:$A$1840))-ROW($A$1), ROWS($M$3:M298))), \"\")","v":""},{"$f":"IFERROR(INDEX($B$2:$B$1840,_xlfn.AGGREGATE(15,3,(($A$2:$A$1840=$N$3)/($A$2:$A$1840=$N$3)*ROW($A$2:$A$1840))-ROW($A$1), ROWS($M$3:M298))), \"\")","v":""},null,{"$f":"IFERROR(INDEX($G$2:$G$1840,_xlfn.AGGREGATE(15,3,(($A$2:$A$1840=$N$3)/($A$2:$A$1840=$N$3)*ROW($A$2:$A$1840))-ROW($A$1), ROWS($M$3:M298))), \"\")","v":""},""]
["0049","King Open","00490035",null,"PK - 05","SW",346,null,"ES",117,174.4,null,null,null,{"$f":"IFERROR((RANK(T299,$T$3:$T$191,0)+COUNTIF(T$3:T487, T299)-1), \"\")","v":""},{"$f":"IFERROR(INDEX($C$2:$C$1840,_xlfn.AGGREGATE(15,3,(($A$2:$A$1840=$N$3)/($A$2:$A$1840=$N$3)*ROW($A$2:$A$1840))-ROW($A$1), ROWS($M$3:M299))), \"\")","v":""},{"$f":"IFERROR(INDEX($B$2:$B$1840,_xlfn.AGGREGATE(15,3,(($A$2:$A$1840=$N$3)/($A$2:$A$1840=$N$3)*ROW($A$2:$A$1840))-ROW($A$1), ROWS($M$3:M299))), \"\")","v":""},null,{"$f":"IFERROR(INDEX($G$2:$G$1840,_xlfn.AGGREGATE(15,3,(($A$2:$A$1840=$N$3)/($A$2:$A$1840=$N$3)*ROW($A$2:$A$1840))-ROW($A$1), ROWS($M$3:M299))), \"\")","v":""},""]
["0049","Kennedy-Longfellow","00490040",null,"PK - 05","SW",241,null,"ES",124,174.4,null,null,null,{"$f":"IFERROR((RANK(T300,$T$3:$T$191,0)+COUNTIF(T$3:T488, T300)-1), \"\")","v":""},{"$f":"IFERROR(INDEX($C$2:$C$1840,_xlfn.AGGREGATE(15,3,(($A$2:$A$1840=$N$3)/($A$2:$A$1840=$N$3)*ROW($A$2:$A$1840))-ROW($A$1), ROWS($M$3:M300))), \"\")","v":""},{"$f":"IFERROR(INDEX($B$2:$B$1840,_xlfn.AGGREGATE(15,3,(($A$2:$A$1840=$N$3)/($A$2:$A$1840=$N$3)*ROW($A$2:$A$1840))-ROW($A$1), ROWS($M$3:M300))), \"\")","v":""},null,{"$f":"IFERROR(INDEX($G$2:$G$1840,_xlfn.AGGREGATE(15,3,(($A$2:$A$1840=$N$3)/($A$2:$A$1840=$N$3)*ROW($A$2:$A$1840))-ROW($A$1), ROWS($M$3:M300))), \"\")","v":""},""]
["0049","Morse","00490045",null,"PK - 05","SW",311,null,"ES",108,148.80000000000001,null,null,null,{"$f":"IFERROR((RANK(T301,$T$3:$T$191,0)+COUNTIF(T$3:T489, T301)-1), \"\")","v":""},{"$f":"IFERROR(INDEX($C$2:$C$1840,_xlfn.AGGREGATE(15,3,(($A$2:$A$1840=$N$3)/($A$2:$A$1840=$N$3)*ROW($A$2:$A$1840))-ROW($A$1), ROWS($M$3:M301))), \"\")","v":""},{"$f":"IFERROR(INDEX($B$2:$B$1840,_xlfn.AGGREGATE(15,3,(($A$2:$A$1840=$N$3)/($A$2:$A$1840=$N$3)*ROW($A$2:$A$1840))-ROW($A$1), ROWS($M$3:M301))), \"\")","v":""},null,{"$f":"IFERROR(INDEX($G$2:$G$1840,_xlfn.AGGREGATE(15,3,(($A$2:$A$1840=$N$3)/($A$2:$A$1840=$N$3)*ROW($A$2:$A$1840))-ROW($A$1), ROWS($M$3:M301))), \"\")","v":""},""]
["0049","Peabody","00490050",null,"PK - 05","NT",300,null,"ES",95,131.20000000000002,null,null,null,{"$f":"IFERROR((RANK(T302,$T$3:$T$191,0)+COUNTIF(T$3:T490, T302)-1), \"\")","v":""},{"$f":"IFERROR(INDEX($C$2:$C$1840,_xlfn.AGGREGATE(15,3,(($A$2:$A$1840=$N$3)/($A$2:$A$1840=$N$3)*ROW($A$2:$A$1840))-ROW($A$1), ROWS($M$3:M302))), \"\")","v":""},{"$f":"IFERROR(INDEX($B$2:$B$1840,_xlfn.AGGREGATE(15,3,(($A$2:$A$1840=$N$3)/($A$2:$A$1840=$N$3)*ROW($A$2:$A$1840))-ROW($A$1), ROWS($M$3:M302))), \"\")","v":""},null,{"$f":"IFERROR(INDEX($G$2:$G$1840,_xlfn.AGGREGATE(15,3,(($A$2:$A$1840=$N$3)/($A$2:$A$1840=$N$3)*ROW($A$2:$A$1840))-ROW($A$1), ROWS($M$3:M302))), \"\")","v":""},""]
["0049","John M Tobin","00490065",null,"PK - 05","NT",302,null,"ES",77,89.600000000000009,null,null,null,{"$f":"IFERROR((RANK(T303,$T$3:$T$191,0)+COUNTIF(T$3:T491, T303)-1), \"\")","v":""},{"$f":"IFERROR(INDEX($C$2:$C$1840,_xlfn.AGGREGATE(15,3,(($A$2:$A$1840=$N$3)/($A$2:$A$1840=$N$3)*ROW($A$2:$A$1840))-ROW($A$1), ROWS($M$3:M303))), \"\")","v":""},{"$f":"IFERROR(INDEX($B$2:$B$1840,_xlfn.AGGREGATE(15,3,(($A$2:$A$1840=$N$3)/($A$2:$A$1840=$N$3)*ROW($A$2:$A$1840))-ROW($A$1), ROWS($M$3:M303))), \"\")","v":""},null,{"$f":"IFERROR(INDEX($G$2:$G$1840,_xlfn.AGGREGATE(15,3,(($A$2:$A$1840=$N$3)/($A$2:$A$1840=$N$3)*ROW($A$2:$A$1840))-ROW($A$1), ROWS($M$3:M303))), \"\")","v":""},""]
["0049","Graham and Parks","00490080",null,"PK - 05","NT",332,null,"ES",92,131.20000000000002,null,null,null,{"$f":"IFERROR((RANK(T304,$T$3:$T$191,0)+COUNTIF($T$3:$T$191, T304)-1), \"\")","v":""},{"$f":"IFERROR(INDEX($C$2:$C$1840,_xlfn.AGGREGATE(15,3,(($A$2:$A$1840=$N$3)/($A$2:$A$1840=$N$3)*ROW($A$2:$A$1840))-ROW($A$1), ROWS($M$3:M304))), \"\")","v":""},{"$f":"IFERROR(INDEX($B$2:$B$1840,_xlfn.AGGREGATE(15,3,(($A$2:$A$1840=$N$3)/($A$2:$A$1840=$N$3)*ROW($A$2:$A$1840))-ROW($A$1), ROWS($M$3:M304))), \"\")","v":""},null,{"$f":"IFERROR(INDEX($G$2:$G$1840,_xlfn.AGGREGATE(15,3,(($A$2:$A$1840=$N$3)/($A$2:$A$1840=$N$3)*ROW($A$2:$A$1840))-ROW($A$1), ROWS($M$3:M304))), \"\")","v":""},""]
["0049","Fletcher/Maynard Academy","00490090",null,"PK - 05","SW",269,null,"ES",143,200,null,null,null,"",{"$f":"IFERROR(INDEX($C$2:$C$1840,_xlfn.AGGREGATE(15,3,(($A$2:$A$1840=$N$3)/($A$2:$A$1840=$N$3)*ROW($A$2:$A$1840))-ROW($A$1), ROWS($M$3:M305))), \"\")","v":""},{"$f":"IFERROR(INDEX($B$2:$B$1840,_xlfn.AGGREGATE(15,3,(($A$2:$A$1840=$N$3)/($A$2:$A$1840=$N$3)*ROW($A$2:$A$1840))-ROW($A$1), ROWS($M$3:M305))), \"\")","v":""},null,{"$f":"IFERROR(INDEX($G$2:$G$1840,_xlfn.AGGREGATE(15,3,(($A$2:$A$1840=$N$3)/($A$2:$A$1840=$N$3)*ROW($A$2:$A$1840))-ROW($A$1), ROWS($M$3:M305))), \"\")","v":""},""]
["0049","Cambridge Street Upper School","00490305",null,"06 - 08","SW",295,null,"MS",126,201.60000000000002,null,null,null,"",{"$f":"IFERROR(INDEX($C$2:$C$1840,_xlfn.AGGREGATE(15,3,(($A$2:$A$1840=$N$3)/($A$2:$A$1840=$N$3)*ROW($A$2:$A$1840))-ROW($A$1), ROWS($M$3:M306))), \"\")","v":""},{"$f":"IFERROR(INDEX($B$2:$B$1840,_xlfn.AGGREGATE(15,3,(($A$2:$A$1840=$N$3)/($A$2:$A$1840=$N$3)*ROW($A$2:$A$1840))-ROW($A$1), ROWS($M$3:M306))), \"\")","v":""},null,{"$f":"IFERROR(INDEX($G$2:$G$1840,_xlfn.AGGREGATE(15,3,(($A$2:$A$1840=$N$3)/($A$2:$A$1840=$N$3)*ROW($A$2:$A$1840))-ROW($A$1), ROWS($M$3:M306))), \"\")","v":""},""]
["0049","Putnam Avenue Upper School","00490310",null,"06 - 08","SW",261,null,"MS",121,193.60000000000002,null,null,null,"",{"$f":"IFERROR(INDEX($C$2:$C$1840,_xlfn.AGGREGATE(15,3,(($A$2:$A$1840=$N$3)/($A$2:$A$1840=$N$3)*ROW($A$2:$A$1840))-ROW($A$1), ROWS($M$3:M307))), \"\")","v":""},{"$f":"IFERROR(INDEX($B$2:$B$1840,_xlfn.AGGREGATE(15,3,(($A$2:$A$1840=$N$3)/($A$2:$A$1840=$N$3)*ROW($A$2:$A$1840))-ROW($A$1), ROWS($M$3:M307))), \"\")","v":""},null,{"$f":"IFERROR(INDEX($G$2:$G$1840,_xlfn.AGGREGATE(15,3,(($A$2:$A$1840=$N$3)/($A$2:$A$1840=$N$3)*ROW($A$2:$A$1840))-ROW($A$1), ROWS($M$3:M307))), \"\")","v":""},""]
["0049","Rindge Avenue Upper School","00490315",null,"06 - 08","NT",262,null,"MS",82,131.20000000000002,null,null,null,"",{"$f":"IFERROR(INDEX($C$2:$C$1840,_xlfn.AGGREGATE(15,3,(($A$2:$A$1840=$N$3)/($A$2:$A$1840=$N$3)*ROW($A$2:$A$1840))-ROW($A$1), ROWS($M$3:M308))), \"\")","v":""},{"$f":"IFERROR(INDEX($B$2:$B$1840,_xlfn.AGGREGATE(15,3,(($A$2:$A$1840=$N$3)/($A$2:$A$1840=$N$3)*ROW($A$2:$A$1840))-ROW($A$1), ROWS($M$3:M308))), \"\")","v":""},null,null,""]
["0049","Vassal Lane Upper School","00490320",null,"06 - 08","NT",291,null,"MS",100,160,null,null,null,"",{"$f":"IFERROR(INDEX($C$2:$C$1840,_xlfn.AGGREGATE(15,3,(($A$2:$A$1840=$N$3)/($A$2:$A$1840=$N$3)*ROW($A$2:$A$1840))-ROW($A$1), ROWS($M$3:M309))), \"\")","v":""},{"$f":"IFERROR(INDEX($B$2:$B$1840,_xlfn.AGGREGATE(15,3,(($A$2:$A$1840=$N$3)/($A$2:$A$1840=$N$3)*ROW($A$2:$A$1840))-ROW($A$1), ROWS($M$3:M309))), \"\")","v":""},null,null,""]
["0049","Cambridge Rindge and Latin","00490506",null,"09 - 12","NT",1823,null,"HS",608,953.6,null,null,null,"",{"$f":"IFERROR(INDEX($C$2:$C$1840,_xlfn.AGGREGATE(15,3,(($A$2:$A$1840=$N$3)/($A$2:$A$1840=$N$3)*ROW($A$2:$A$1840))-ROW($A$1), ROWS($M$3:M310))), \"\")","v":""},{"$f":"IFERROR(INDEX($B$2:$B$1840,_xlfn.AGGREGATE(15,3,(($A$2:$A$1840=$N$3)/($A$2:$A$1840=$N$3)*ROW($A$2:$A$1840))-ROW($A$1), ROWS($M$3:M310))), \"\")","v":""},null,null,""]
["0050","Rodman Early Childhood Center","00500010",null,"PK","NT",29,null,"EES",5,0,null,null,null,"",{"$f":"IFERROR(INDEX($C$2:$C$1840,_xlfn.AGGREGATE(15,3,(($A$2:$A$1840=$N$3)/($A$2:$A$1840=$N$3)*ROW($A$2:$A$1840))-ROW($A$1), ROWS($M$3:M311))), \"\")","v":""},{"$f":"IFERROR(INDEX($B$2:$B$1840,_xlfn.AGGREGATE(15,3,(($A$2:$A$1840=$N$3)/($A$2:$A$1840=$N$3)*ROW($A$2:$A$1840))-ROW($A$1), ROWS($M$3:M311))), \"\")","v":""},null,null,""]
["0050","Lt Peter M Hansen","00500012",null,"K - 05","TA",500,null,"ES",92,147.20000000000002,null,null,null,{"$f":"IFERROR(RANK(T312,$T$3:$T$191,0), \"\")","v":""},{"$f":"IFERROR(INDEX($C$2:$C$1840,_xlfn.AGGREGATE(15,3,(($A$2:$A$1840=$N$3)/($A$2:$A$1840=$N$3)*ROW($A$2:$A$1840))-ROW($A$1), ROWS($M$3:M312))), \"\")","v":""},{"$f":"IFERROR(INDEX($B$2:$B$1840,_xlfn.AGGREGATE(15,3,(($A$2:$A$1840=$N$3)/($A$2:$A$1840=$N$3)*ROW($A$2:$A$1840))-ROW($A$1), ROWS($M$3:M312))), \"\")","v":""},null,null,""]
["0050","John F Kennedy","00500017",null,"K - 05","NT",465,null,"ES",50,80,null,null,null,"",{"$f":"IFERROR(INDEX($C$2:$C$1840,_xlfn.AGGREGATE(15,3,(($A$2:$A$1840=$N$3)/($A$2:$A$1840=$N$3)*ROW($A$2:$A$1840))-ROW($A$1), ROWS($M$3:M313))), \"\")","v":""},{"$f":"IFERROR(INDEX($B$2:$B$1840,_xlfn.AGGREGATE(15,3,(($A$2:$A$1840=$N$3)/($A$2:$A$1840=$N$3)*ROW($A$2:$A$1840))-ROW($A$1), ROWS($M$3:M313))), \"\")","v":""},null,null,""]
["0050","Dean S Luce","00500020",null,"K - 05","TA",460,null,"ES",96,153.60000000000002,null,null,null,"",{"$f":"IFERROR(INDEX($C$2:$C$1840,_xlfn.AGGREGATE(15,3,(($A$2:$A$1840=$N$3)/($A$2:$A$1840=$N$3)*ROW($A$2:$A$1840))-ROW($A$1), ROWS($M$3:M314))), \"\")","v":""},{"$f":"IFERROR(INDEX($B$2:$B$1840,_xlfn.AGGREGATE(15,3,(($A$2:$A$1840=$N$3)/($A$2:$A$1840=$N$3)*ROW($A$2:$A$1840))-ROW($A$1), ROWS($M$3:M314))), \"\")","v":""},null,null,""]
["0050","Wm H Galvin Middle","00500305",null,"06 - 08","NT",767,null,"MS",145,232,null,null,null,"",{"$f":"IFERROR(INDEX($C$2:$C$1840,_xlfn.AGGREGATE(15,3,(($A$2:$A$1840=$N$3)/($A$2:$A$1840=$N$3)*ROW($A$2:$A$1840))-ROW($A$1), ROWS($M$3:M315))), \"\")","v":""},{"$f":"IFERROR(INDEX($B$2:$B$1840,_xlfn.AGGREGATE(15,3,(($A$2:$A$1840=$N$3)/($A$2:$A$1840=$N$3)*ROW($A$2:$A$1840))-ROW($A$1), ROWS($M$3:M315))), \"\")","v":""},null,null,""]
["0050","Canton High","00500505",null,"09 - 12","NT",939,null,"HS",167,267.2,null,null,null,"",{"$f":"IFERROR(INDEX($C$2:$C$1840,_xlfn.AGGREGATE(15,3,(($A$2:$A$1840=$N$3)/($A$2:$A$1840=$N$3)*ROW($A$2:$A$1840))-ROW($A$1), ROWS($M$3:M316))), \"\")","v":""},{"$f":"IFERROR(INDEX($B$2:$B$1840,_xlfn.AGGREGATE(15,3,(($A$2:$A$1840=$N$3)/($A$2:$A$1840=$N$3)*ROW($A$2:$A$1840))-ROW($A$1), ROWS($M$3:M316))), \"\")","v":""},null,null,""]
["0051","Carlisle School","00510025",null,"PK - 08","TA",591,null,"ESMS",29,46.400000000000006,null,null,null,"",{"$f":"IFERROR(INDEX($C$2:$C$1840,_xlfn.AGGREGATE(15,3,(($A$2:$A$1840=$N$3)/($A$2:$A$1840=$N$3)*ROW($A$2:$A$1840))-ROW($A$1), ROWS($M$3:M317))), \"\")","v":""},{"$f":"IFERROR(INDEX($B$2:$B$1840,_xlfn.AGGREGATE(15,3,(($A$2:$A$1840=$N$3)/($A$2:$A$1840=$N$3)*ROW($A$2:$A$1840))-ROW($A$1), ROWS($M$3:M317))), \"\")","v":""},null,null,""]
["0052","Carver Elementary School","00520015",null,"PK - 05","SW",742,null,"ES",200,300.8,null,null,null,"",{"$f":"IFERROR(INDEX($C$2:$C$1840,_xlfn.AGGREGATE(15,3,(($A$2:$A$1840=$N$3)/($A$2:$A$1840=$N$3)*ROW($A$2:$A$1840))-ROW($A$1), ROWS($M$3:M318))), \"\")","v":""},{"$f":"IFERROR(INDEX($B$2:$B$1840,_xlfn.AGGREGATE(15,3,(($A$2:$A$1840=$N$3)/($A$2:$A$1840=$N$3)*ROW($A$2:$A$1840))-ROW($A$1), ROWS($M$3:M318))), \"\")","v":""},null,null,""]
["0052","Carver Middle/High School","00520405",null,"06 - 12","NT",739,null,"MSHS/K-12",193,308.8,null,null,null,"",{"$f":"IFERROR(INDEX($C$2:$C$1840,_xlfn.AGGREGATE(15,3,(($A$2:$A$1840=$N$3)/($A$2:$A$1840=$N$3)*ROW($A$2:$A$1840))-ROW($A$1), ROWS($M$3:M319))), \"\")","v":""},{"$f":"IFERROR(INDEX($B$2:$B$1840,_xlfn.AGGREGATE(15,3,(($A$2:$A$1840=$N$3)/($A$2:$A$1840=$N$3)*ROW($A$2:$A$1840))-ROW($A$1), ROWS($M$3:M319))), \"\")","v":""},null,null,""]
["0056","Community Education Center","00560001",null,"PK","NT",91,null,"EES",33,0,null,null,null,"",{"$f":"IFERROR(INDEX($C$2:$C$1840,_xlfn.AGGREGATE(15,3,(($A$2:$A$1840=$N$3)/($A$2:$A$1840=$N$3)*ROW($A$2:$A$1840))-ROW($A$1), ROWS($M$3:M320))), \"\")","v":""},{"$f":"IFERROR(INDEX($B$2:$B$1840,_xlfn.AGGREGATE(15,3,(($A$2:$A$1840=$N$3)/($A$2:$A$1840=$N$3)*ROW($A$2:$A$1840))-ROW($A$1), ROWS($M$3:M320))), \"\")","v":""},null,null,""]
["0056","Center Elementary School","00560005",null,"K - 04","TA",476,null,"ES",77,123.2,null,null,null,"",{"$f":"IFERROR(INDEX($C$2:$C$1840,_xlfn.AGGREGATE(15,3,(($A$2:$A$1840=$N$3)/($A$2:$A$1840=$N$3)*ROW($A$2:$A$1840))-ROW($A$1), ROWS($M$3:M321))), \"\")","v":""},{"$f":"IFERROR(INDEX($B$2:$B$1840,_xlfn.AGGREGATE(15,3,(($A$2:$A$1840=$N$3)/($A$2:$A$1840=$N$3)*ROW($A$2:$A$1840))-ROW($A$1), ROWS($M$3:M321))), \"\")","v":""},null,null,""]
["0056","South Row","00560015",null,"K - 04","NT",415,null,"ES",49,78.400000000000006,null,null,null,"",{"$f":"IFERROR(INDEX($C$2:$C$1840,_xlfn.AGGREGATE(15,3,(($A$2:$A$1840=$N$3)/($A$2:$A$1840=$N$3)*ROW($A$2:$A$1840))-ROW($A$1), ROWS($M$3:M322))), \"\")","v":""},{"$f":"IFERROR(INDEX($B$2:$B$1840,_xlfn.AGGREGATE(15,3,(($A$2:$A$1840=$N$3)/($A$2:$A$1840=$N$3)*ROW($A$2:$A$1840))-ROW($A$1), ROWS($M$3:M322))), \"\")","v":""},null,null,""]
["0056","Charles D Harrington","00560025",null,"K - 04","TA",491,null,"ES",111,177.60000000000002,null,null,null,"",{"$f":"IFERROR(INDEX($C$2:$C$1840,_xlfn.AGGREGATE(15,3,(($A$2:$A$1840=$N$3)/($A$2:$A$1840=$N$3)*ROW($A$2:$A$1840))-ROW($A$1), ROWS($M$3:M323))), \"\")","v":""},{"$f":"IFERROR(INDEX($B$2:$B$1840,_xlfn.AGGREGATE(15,3,(($A$2:$A$1840=$N$3)/($A$2:$A$1840=$N$3)*ROW($A$2:$A$1840))-ROW($A$1), ROWS($M$3:M323))), \"\")","v":""},null,null,{"$f":"IFERROR(R323/S323, \"\")","v":""}]
["0056","Byam School","00560030",null,"K - 04","TA",460,null,"ES",77,123.2,null,null,null,{"$f":"IFERROR(RANK(T324,$T$3:$T$191,0), \"\")","v":""},{"$f":"IFERROR(INDEX($C$2:$C$1840,_xlfn.AGGREGATE(15,3,(($A$2:$A$1840=$N$3)/($A$2:$A$1840=$N$3)*ROW($A$2:$A$1840))-ROW($A$1), ROWS($M$3:M324))), \"\")","v":""},{"$f":"IFERROR(INDEX($B$2:$B$1840,_xlfn.AGGREGATE(15,3,(($A$2:$A$1840=$N$3)/($A$2:$A$1840=$N$3)*ROW($A$2:$A$1840))-ROW($A$1), ROWS($M$3:M324))), \"\")","v":""}]
["0056","Col Moses Parker School","00560305",null,"05 - 08","TA",720,null,"MS",126,201.60000000000002,null,null,null,{"$f":"IFERROR(RANK(T325,$T$3:$T$191,0), \"\")","v":""},{"$f":"IFERROR(INDEX($C$2:$C$1840,_xlfn.AGGREGATE(15,3,(($A$2:$A$1840=$N$3)/($A$2:$A$1840=$N$3)*ROW($A$2:$A$1840))-ROW($A$1), ROWS($M$3:M325))), \"\")","v":""},{"$f":"IFERROR(INDEX($B$2:$B$1840,_xlfn.AGGREGATE(15,3,(($A$2:$A$1840=$N$3)/($A$2:$A$1840=$N$3)*ROW($A$2:$A$1840))-ROW($A$1), ROWS($M$3:M325))), \"\")","v":""}]
["0056","McCarthy Middle School","00560310",null,"05 - 08","TA",771,null,"MS",107,171.20000000000002,null,null,null,null,{"$f":"IFERROR(INDEX($C$2:$C$1840,_xlfn.AGGREGATE(15,3,(($A$2:$A$1840=$N$3)/($A$2:$A$1840=$N$3)*ROW($A$2:$A$1840))-ROW($A$1), ROWS($M$3:M326))), \"\")","v":""},{"$f":"IFERROR(INDEX($B$2:$B$1840,_xlfn.AGGREGATE(15,3,(($A$2:$A$1840=$N$3)/($A$2:$A$1840=$N$3)*ROW($A$2:$A$1840))-ROW($A$1), ROWS($M$3:M326))), \"\")","v":""}]
["0056","Chelmsford High","00560505",null,"09 - 12","NT",1398,null,"HS",160,256,null,null,null,null,{"$f":"IFERROR(INDEX($C$2:$C$1840,_xlfn.AGGREGATE(15,3,(($A$2:$A$1840=$N$3)/($A$2:$A$1840=$N$3)*ROW($A$2:$A$1840))-ROW($A$1), ROWS($M$3:M327))), \"\")","v":""},{"$f":"IFERROR(INDEX($B$2:$B$1840,_xlfn.AGGREGATE(15,3,(($A$2:$A$1840=$N$3)/($A$2:$A$1840=$N$3)*ROW($A$2:$A$1840))-ROW($A$1), ROWS($M$3:M327))), \"\")","v":""}]
["0057","Shurtleff Early Childhood","00570003",null,"PK - 01","SW",779,null,"EES",570,699.2,null,null,null,null,{"$f":"IFERROR(INDEX($C$2:$C$1840,_xlfn.AGGREGATE(15,3,(($A$2:$A$1840=$N$3)/($A$2:$A$1840=$N$3)*ROW($A$2:$A$1840))-ROW($A$1), ROWS($M$3:M328))), \"\")","v":""},{"$f":"IFERROR(INDEX($B$2:$B$1840,_xlfn.AGGREGATE(15,3,(($A$2:$A$1840=$N$3)/($A$2:$A$1840=$N$3)*ROW($A$2:$A$1840))-ROW($A$1), ROWS($M$3:M328))), \"\")","v":""}]
["0057","William A Berkowitz Elementary","00570025",null,"01 - 04","SW",481,null,"ES",367,587.20000000000005,null,null,null,null,{"$f":"IFERROR(INDEX($C$2:$C$1840,_xlfn.AGGREGATE(15,3,(($A$2:$A$1840=$N$3)/($A$2:$A$1840=$N$3)*ROW($A$2:$A$1840))-ROW($A$1), ROWS($M$3:M329))), \"\")","v":""},{"$f":"IFERROR(INDEX($B$2:$B$1840,_xlfn.AGGREGATE(15,3,(($A$2:$A$1840=$N$3)/($A$2:$A$1840=$N$3)*ROW($A$2:$A$1840))-ROW($A$1), ROWS($M$3:M329))), \"\")","v":""}]
["0057","Edgar A Hooks Elementary","00570030",null,"01 - 04","SW",514,null,"ES",374,598.4,null,null,null,null,{"$f":"IFERROR(INDEX($C$2:$C$1840,_xlfn.AGGREGATE(15,3,(($A$2:$A$1840=$N$3)/($A$2:$A$1840=$N$3)*ROW($A$2:$A$1840))-ROW($A$1), ROWS($M$3:M330))), \"\")","v":""},{"$f":"IFERROR(INDEX($B$2:$B$1840,_xlfn.AGGREGATE(15,3,(($A$2:$A$1840=$N$3)/($A$2:$A$1840=$N$3)*ROW($A$2:$A$1840))-ROW($A$1), ROWS($M$3:M330))), \"\")","v":""}]
["0057","George F. Kelly Elementary","00570035",null,"01 - 06","SW",468,null,"ES",293,468.8,null,null,null,null,{"$f":"IFERROR(INDEX($C$2:$C$1840,_xlfn.AGGREGATE(15,3,(($A$2:$A$1840=$N$3)/($A$2:$A$1840=$N$3)*ROW($A$2:$A$1840))-ROW($A$1), ROWS($M$3:M331))), \"\")","v":""},{"$f":"IFERROR(INDEX($B$2:$B$1840,_xlfn.AGGREGATE(15,3,(($A$2:$A$1840=$N$3)/($A$2:$A$1840=$N$3)*ROW($A$2:$A$1840))-ROW($A$1), ROWS($M$3:M331))), \"\")","v":""}]
["0057","Frank M Sokolowski Elementary","00570040",null,"01 - 04","SW",498,null,"ES",384,614.40000000000009,null,null,null,null,{"$f":"IFERROR(INDEX($C$2:$C$1840,_xlfn.AGGREGATE(15,3,(($A$2:$A$1840=$N$3)/($A$2:$A$1840=$N$3)*ROW($A$2:$A$1840))-ROW($A$1), ROWS($M$3:M332))), \"\")","v":""},{"$f":"IFERROR(INDEX($B$2:$B$1840,_xlfn.AGGREGATE(15,3,(($A$2:$A$1840=$N$3)/($A$2:$A$1840=$N$3)*ROW($A$2:$A$1840))-ROW($A$1), ROWS($M$3:M332))), \"\")","v":""}]
["0057","Eugene Wright Science and Technology Academy","00570045",null,"05 - 08","SW",517,null,"MS",397,635.20000000000005,null,null,null,null,{"$f":"IFERROR(INDEX($C$2:$C$1840,_xlfn.AGGREGATE(15,3,(($A$2:$A$1840=$N$3)/($A$2:$A$1840=$N$3)*ROW($A$2:$A$1840))-ROW($A$1), ROWS($M$3:M333))), \"\")","v":""},{"$f":"IFERROR(INDEX($B$2:$B$1840,_xlfn.AGGREGATE(15,3,(($A$2:$A$1840=$N$3)/($A$2:$A$1840=$N$3)*ROW($A$2:$A$1840))-ROW($A$1), ROWS($M$3:M333))), \"\")","v":""}]
["0057","Clark Avenue School","00570050",null,"05 - 08","SW",702,null,"MS",486,777.6,null,null,null,null,{"$f":"IFERROR(INDEX($C$2:$C$1840,_xlfn.AGGREGATE(15,3,(($A$2:$A$1840=$N$3)/($A$2:$A$1840=$N$3)*ROW($A$2:$A$1840))-ROW($A$1), ROWS($M$3:M334))), \"\")","v":""},{"$f":"IFERROR(INDEX($B$2:$B$1840,_xlfn.AGGREGATE(15,3,(($A$2:$A$1840=$N$3)/($A$2:$A$1840=$N$3)*ROW($A$2:$A$1840))-ROW($A$1), ROWS($M$3:M334))), \"\")","v":""}]
["0057","Joseph A. Browne School","00570055",null,"05 - 08","SW",534,null,"MS",405,648,null,null,null,null,{"$f":"IFERROR(INDEX($C$2:$C$1840,_xlfn.AGGREGATE(15,3,(($A$2:$A$1840=$N$3)/($A$2:$A$1840=$N$3)*ROW($A$2:$A$1840))-ROW($A$1), ROWS($M$3:M335))), \"\")","v":""},{"$f":"IFERROR(INDEX($B$2:$B$1840,_xlfn.AGGREGATE(15,3,(($A$2:$A$1840=$N$3)/($A$2:$A$1840=$N$3)*ROW($A$2:$A$1840))-ROW($A$1), ROWS($M$3:M335))), \"\")","v":""}]
["0057","Chelsea High","00570505",null,"09 - 12","SW",1417,null,"HS",963,1531.2,null,null,null,null,{"$f":"IFERROR(INDEX($C$2:$C$1840,_xlfn.AGGREGATE(15,3,(($A$2:$A$1840=$N$3)/($A$2:$A$1840=$N$3)*ROW($A$2:$A$1840))-ROW($A$1), ROWS($M$3:M336))), \"\")","v":""},{"$f":"IFERROR(INDEX($B$2:$B$1840,_xlfn.AGGREGATE(15,3,(($A$2:$A$1840=$N$3)/($A$2:$A$1840=$N$3)*ROW($A$2:$A$1840))-ROW($A$1), ROWS($M$3:M336))), \"\")","v":""}]
["0057","Chelsea Opportunity Academy","00570515",null,"09 - 12","SW",121,null,"HS",83,132.80000000000001,null,null,null,null,{"$f":"IFERROR(INDEX($C$2:$C$1840,_xlfn.AGGREGATE(15,3,(($A$2:$A$1840=$N$3)/($A$2:$A$1840=$N$3)*ROW($A$2:$A$1840))-ROW($A$1), ROWS($M$3:M337))), \"\")","v":""},{"$f":"IFERROR(INDEX($B$2:$B$1840,_xlfn.AGGREGATE(15,3,(($A$2:$A$1840=$N$3)/($A$2:$A$1840=$N$3)*ROW($A$2:$A$1840))-ROW($A$1), ROWS($M$3:M337))), \"\")","v":""}]
["0061","Szetela Early Childhood Center","00610001",null,"PK","NT",138,null,"EES",73,0,null,null,null,null,{"$f":"IFERROR(INDEX($C$2:$C$1840,_xlfn.AGGREGATE(15,3,(($A$2:$A$1840=$N$3)/($A$2:$A$1840=$N$3)*ROW($A$2:$A$1840))-ROW($A$1), ROWS($M$3:M338))), \"\")","v":""},{"$f":"IFERROR(INDEX($B$2:$B$1840,_xlfn.AGGREGATE(15,3,(($A$2:$A$1840=$N$3)/($A$2:$A$1840=$N$3)*ROW($A$2:$A$1840))-ROW($A$1), ROWS($M$3:M338))), \"\")","v":""}]
["0061","Barry","00610003",null,"K - 05","SW",379,null,"ES",215,344,null,null,null,null,{"$f":"IFERROR(INDEX($C$2:$C$1840,_xlfn.AGGREGATE(15,3,(($A$2:$A$1840=$N$3)/($A$2:$A$1840=$N$3)*ROW($A$2:$A$1840))-ROW($A$1), ROWS($M$3:M339))), \"\")","v":""},{"$f":"IFERROR(INDEX($B$2:$B$1840,_xlfn.AGGREGATE(15,3,(($A$2:$A$1840=$N$3)/($A$2:$A$1840=$N$3)*ROW($A$2:$A$1840))-ROW($A$1), ROWS($M$3:M339))), \"\")","v":""}]
["0061","Belcher","00610010",null,"K - 02","SW",215,null,"EES",150,240,null,null,null,null,{"$f":"IFERROR(INDEX($C$2:$C$1840,_xlfn.AGGREGATE(15,3,(($A$2:$A$1840=$N$3)/($A$2:$A$1840=$N$3)*ROW($A$2:$A$1840))-ROW($A$1), ROWS($M$3:M340))), \"\")","v":""},{"$f":"IFERROR(INDEX($B$2:$B$1840,_xlfn.AGGREGATE(15,3,(($A$2:$A$1840=$N$3)/($A$2:$A$1840=$N$3)*ROW($A$2:$A$1840))-ROW($A$1), ROWS($M$3:M340))), \"\")","v":""}]
["0061","Bowe","00610015",null,"K - 05","SW",449,null,"ES",360,576,null,null,null,null,{"$f":"IFERROR(INDEX($C$2:$C$1840,_xlfn.AGGREGATE(15,3,(($A$2:$A$1840=$N$3)/($A$2:$A$1840=$N$3)*ROW($A$2:$A$1840))-ROW($A$1), ROWS($M$3:M341))), \"\")","v":""},{"$f":"IFERROR(INDEX($B$2:$B$1840,_xlfn.AGGREGATE(15,3,(($A$2:$A$1840=$N$3)/($A$2:$A$1840=$N$3)*ROW($A$2:$A$1840))-ROW($A$1), ROWS($M$3:M341))), \"\")","v":""}]
["0061","Bowie","00610020",null,"K - 05","NT",277,null,"ES",121,193.60000000000002]
["0061","Chicopee Academy","00610021",null,"07 - 12","NT",53,null,"MSHS/K-12",44,70.400000000000006]
["0061","Litwin","00610022",null,"K - 05","SW",351,null,"ES",231,369.6]
["0061","Lambert-Lavoie","00610040",null,"K - 05","SW",263,null,"ES",147,235.20000000000002]
["0061","Fairview Elementary","00610050",null,"K - 05","SW",407,null,"ES",299,478.40000000000003]
["0061","Streiber Memorial School","00610065",null,"K - 05","NT",246,null,"ES",115,184]
["0061","Gen John J Stefanik","00610090",null,"K - 05","SW",349,null,"ES",271,433.6]
["0061","Bellamy Middle","00610305",null,"06 - 08","SW",817,null,"MS",490,784]
["0061","Dupont Middle","00610310",null,"06 - 08","SW",783,null,"MS",505,808]
["0061","Chicopee High","00610505",null,"09 - 12","NT",936,null,"HS",544,870.40000000000009]
["0061","Chicopee Comprehensive High School","00610510",null,"09 - 12","NT",1141,null,"HS",500,800]
["0063","Clarksburg Elementary","00630010",null,"K - 08","TA",192,null,"ESMS",59,94.4]
["0064","Clinton Elementary","00640050",null,"PK - 04","SW",746,null,"ES",373,571.20000000000005]
["0064","Clinton Middle School","00640305",null,"05 - 08","SW",588,null,"MS",249,398.40000000000003]
["0064","Clinton Senior High","00640505",null,"PK,09 - 12","NT",494,null,"HS",192,300.8]
["0065","Deer Hill","00650005",null,"03 - 05","TA",306,null,"ES",20,32]
["0065","Joseph Osgood","00650010",null,"PK - 02","NT",325,null,"EES",13,20.8]
["0065","Cohasset Middle School","00650305",null,"06 - 08","NT",352,null,"MS",23,36.800000000000004]
["0065","Cohasset High School","00650505",null,"09 - 12","NT",451,null,"HS",34,54.400000000000006]
["0067","Alcott","00670005",null,"PK - 05","TA",454,null,"ES",58,91.2]
["0067","Thoreau","00670020",null,"PK - 05","NT",445,null,"ES",26,36.800000000000004]
["0067","Willard","00670030",null,"PK - 05","NT",428,null,"ES",20,32]
["0067","Concord Middle","00670305",null,"06 - 08","NT",681,null,"MS",60,96]
["0068","Conway Grammar","00680005",null,"PK - 06","NT",127,null,"ES",33,51.2]
["0071","Highlands","00710010",null,"K - 05","SW",357,null,"ES",78,124.80000000000001]
["0071","Great Oak","00710015",null,"K - 05","SW",335,null,"ES",77,123.2]
["0071","Riverside","00710030",null,"PK - 05","SW",316,null,"ES",65,75.2]
["0071","Ivan G Smith","00710032",null,"K - 05","NT",306,null,"ES",52,83.2]
["0071","Willis E Thorpe","00710045",null,"PK - 05","SW",334,null,"ES",62,86.4]
["0071","Holten Richmond Middle School","00710305",null,"06 - 08","NT",789,null,"MS",177,283.2]
["0071","Danvers High","00710505",null,"09 - 12","NT",868,null,"HS",177,280]
["0072","Andrew B. Cushman School","00720005",null,"PK - K","NT",127,null,"EES",43,27.200000000000003]
["0072","Joseph Demello","00720015",null,"01 - 05","SW",372,null,"ES",107,171.20000000000002]
["0072","George H Potter","00720030",null,"PK - 05","SW",366,null,"ES",109,163.20000000000002]
["0072","James M. Quinn School","00720040",null,"K - 05","SW",635,null,"ES",170,272]
["0072","Dartmouth Middle","00720050",null,"06 - 08","NT",870,null,"MS",236,377.6]
["0072","Dartmouth High","00720505",null,"09 - 12","NT",1043,null,"HS",223,356.8]
["0073","Early Childhood Center","00730005",null,"PK - K","TA",292,null,"EES",55,65.600000000000009]
["0073","Avery","00730010",null,"01 - 05","TA",274,null,"ES",130,208]
["0073","Greenlodge","00730025",null,"01 - 05","NT",233,null,"ES",21,33.6]
["0073","Oakdale","00730030",null,"01 - 05","NT",247,null,"ES",35,56]
["0073","Riverdale","00730045",null,"01 - 05","TA",169,null,"ES",51,81.600000000000009]
["0073","Dedham Middle School","00730305",null,"06 - 08","NT",651,null,"MS",167,267.2]
["0073","Dedham High","00730505",null,"09 - 12","NT",686,null,"HS",174,268.8]
["0074","Deerfield Elementary","00740015",null,"PK - 06","TA",317,null,"ES",67,105.60000000000001]
["0077","Douglas Primary School","00770005",null,"PK - 01","TA",190,null,"EES",39,51.2]
["0077","Douglas Elementary School","00770015",null,"02 - 05","TA",351,null,"ES",63,100.80000000000001]
["0077","Douglas Middle School","00770305",null,"06 - 08","NT",275,null,"MS",57,91.2]
["0077","Douglas High School","00770505",null,"09 - 12","NT",352,null,"HS",69,110.4]
["0078","Chickering","00780005",null,"PK - 05","TA",485,null,"ES",11,17.600000000000001]
["0079","Joseph A Campbell Elementary","00790020",null,"PK - 05","NT",583,null,"ES",122,168]
["0079","Greenmont Avenue","00790030",null,"K - 05","SW",286,null,"ES",108,172.8]
["0079","Brookside Elementary","00790035",null,"K - 05","SW",447,null,"ES",146,233.60000000000002]
["0079","George H. Englesby Elementary School","00790045",null,"K - 05","SW",539,null,"ES",196,313.60000000000002]
["0079","Justus C. Richardson Middle School","00790410",null,"06 - 08","SW",917,null,"MS",266,425.6]
["0079","Dracut Senior High","00790505",null,"09 - 12","NT",891,null,"HS",229,356.8]
["0082","Alden School","00820004",null,"03 - 05","TA",606,null,"ES",48,76.800000000000011]
["0082","Chandler Elementary","00820006",null,"PK - 02","TA",569,null,"EES",39,56]
["0082","Duxbury Middle","00820305",null,"06 - 08","TA",662,null,"MS",40,64]
["0082","Duxbury High","00820505",null,"09 - 12","NT",955,null,"HS",77,121.60000000000001]
["0083","Central","00830005",null,"PK - 02","TA",499,null,"EES",131,185.60000000000002]
["0083","Gordon W. Mitchell School","00830010",null,"03 - 06","NT",634,null,"ES",146,233.60000000000002]
["0083","East Bridgewater JR./SR. High School","00830505",null,"07 - 12","NT",953,null,"MSHS/K-12",202,323.20000000000005]
["0085","Eastham Elementary","00850005",null,"PK - 05","TA",190,null,"ES",78,102.4]
["0086","Center School","00860005",null,"K - 04","TA",186,null,"ES",62,99.2]
["0086","Maple","00860010",null,"PK - 04","TA",212,null,"ES",83,110.4]
["0086","Neil A Pepin","00860020",null,"K - 04","TA",187,null,"ES",82,131.20000000000002]
["0086","White Brook Middle School","00860305",null,"05 - 08","NT",437,null,"MS",155,248]
["0086","Easthampton High","00860505",null,"09 - 12","NT",396,null,"HS",121,190.4]
["0087","Mapleshade","00870010",null,"03 - 05","SW",273,null,"ES",85,136]
["0087","Meadow Brook","00870013",null,"PK - 02","SW",464,null,"EES",113,171.20000000000002]
["0087","Mountain View","00870015",null,"03 - 05","NT",269,null,"ES",51,81.600000000000009]
["0087","Birchland Park","00870305",null,"06 - 08","SW",582,null,"MS",145,232]
["0087","East Longmeadow High","00870505",null,"09 - 12","NT",804,null,"HS",163,257.60000000000002]
["0088","Center School","00880003",null,"K - 02","NT",189,null,"EES",48,76.800000000000011]
["0088","Parkview Elementary","00880015",null,"PK - 02","NT",284,null,"EES",39,38.400000000000006]
["0088","Moreau Hall","00880020",null,"PK - 02","NT",186,null,"EES",44,67.2]
["0088","Richardson Olmsted School","00880025",null,"03 - 05","TA",772,null,"ES",130,208]
["0088","Easton Middle School","00880405",null,"06 - 08","TA",871,null,"MS",130,208]
["0088","Oliver Ames High","00880505",null,"09 - 12","NT",1124,null,"HS",181,278.40000000000003]
["0089","Edgartown Elementary","00890005",null,"PK - 08","TA",381,null,"ESMS",142,219.20000000000002]
["0091","Erving Elementary","00910030",null,"PK - 06","TA",114,null,"ES",36,49.6]
["0093","Webster Extension","00930001",null,"PK","NT",149,null,"EES",82,0]
["0093","Adams School","00930003",null,"PK","NT",130,null,"EES",73,0]
["0093","Sumner G. Whittier School","00930010",null,"K - 08","SW",646,null,"ESMS",450,720]
["0093","Webster School","00930015",null,"K - 05","NT",344,null,"ES",203,324.8]
["0093","Madeline English School","00930018",null,"K - 08","SW",723,null,"ESMS",413,660.80000000000007]
["0093","George Keverian School","00930028",null,"K - 08","SW",896,null,"ESMS",564,902.40000000000009]
["0093","Devens School","00930030",null,"K,02 - 12","NT",53,null,"MSHS/K-12",43,68.8]
["0093","Lafayette School","00930038",null,"K - 08","SW",1002,null,"ESMS",622,995.2]
["0093","Parlin School","00930058",null,"K - 08","SW",907,null,"ESMS",635,1016]
["0093","Everett High","00930505",null,"09 - 12","NT",1986,null,"HS",1153,1844.8000000000002]
["0094","East Fairhaven","00940010",null,"PK - 05","TA",326,null,"ES",120,185.60000000000002]
["0094","Leroy Wood","00940030",null,"PK - 05","TA",456,null,"ES",178,276.8]
["0094","Hastings Middle","00940305",null,"06 - 08","TA",442,null,"MS",155,248]
["0094","Fairhaven High","00940505",null,"09 - 12","NT",672,null,"HS",170,270.40000000000003]
["0095","North End Elementary","00950005",null,"PK - 05","NT",758,null,"ES",478,702.40000000000009]
["0095","Carlton M. Viveiros Elementary School","00950009",null,"K - 05","SW",690,null,"ES",578,924.80000000000007]
["0095","Mary Fonseca Elementary School","00950011",null,"PK - 05","SW",604,null,"ES",513,777.6]
["0095","Letourneau Elementary School","00950013",null,"PK - 05","SW",559,null,"ES",436,654.40000000000009]
["0095","Henry Lord Community School","00950017",null,"PK - 08","SW",790,null,"ESMS",672,1025.6000000000001]
["0095","John J Doran","00950045",null,"PK - 08","SW",498,null,"ESMS",414,632]
["0095","William S Greene","00950065",null,"PK - 05","SW",656,null,"ES",490,752]
["0095","Spencer Borden","00950130",null,"PK - 05","NT",580,null,"ES",389,595.20000000000005]
["0095","James Tansey","00950140",null,"K - 05","NT",275,null,"ES",136,217.60000000000002]
["0095","Samuel Watson","00950145",null,"K - 05","SW",243,null,"ES",198,316.8]
["0095","Talbot Innovation School","00950305",null,"06 - 08","SW",561,null,"MS",450,720]
["0095","Morton Middle","00950315",null,"06 - 08","NT",678,null,"MS",446,713.6]
["0095","Matthew J Kuss Middle","00950320",null,"06 - 08","SW",739,null,"MS",538,860.80000000000007]
["0095","Stone PK-12 School","00950340",null,"01 - 12","SW",66,null,"MSHS/K-12",62,99.2]
["0095","B M C Durfee High","00950505",null,"09 - 12","NT",2103,null,"HS",1443,2308.8000000000002]
["0095","Resiliency Preparatory Academy","00950525",null,"07 - 12","SW",233,null,"MSHS/K-12",201,321.60000000000002]
["0096","East Falmouth Elementary","00960005",null,"PK - 04","SW",271,null,"ES",121,137.6]
["0096","Teaticket","00960015",null,"PK - 04","SW",249,null,"ES",125,182.4]
["0096","Mullen-Hall","00960020",null,"K - 04","TA",390,null,"ES",129,206.4]
["0096","North Falmouth Elementary","00960030",null,"K - 04","NT",303,null,"ES",72,115.2]
["0096","Morse Pond School","00960305",null,"05 - 06","NT",488,null,"ES",175,280]
["0096","Lawrence","00960405",null,"07 - 08","NT",510,null,"MS",182,291.2]
["0096","Falmouth High","00960505",null,"09 - 12","NT",802,null,"HS",214,339.20000000000005]
["0097","Crocker Elementary","00970016",null,"PK - 04","SW",575,null,"ES",413,628.80000000000007]
["0097","Reingold Elementary","00970043",null,"PK - 04","SW",575,null,"ES",379,584]
["0097","Memorial Middle School","00970048",null,"05 - 08","SW",655,null,"MS",409,654.40000000000009]
["0097","South Street Elementary","00970060",null,"PK - 04","SW",597,null,"ES",435,670.40000000000009]
["0097","Arthur M Longsjo Middle School","00970315",null,"05 - 08","SW",658,null,"MS",485,776]
["0097","McKay Arts Academy","00970340",null,"PK - 08","SW",668,null,"ESMS",481,745.6]
["0097","Fitchburg High","00970505",null,"PK,09 - 12","SW",1247,null,"HS",770,1222.4000000000001]
["0097","Goodrich Academy","00970510",null,"09 - 12","NT",165,null,"HS",113,161.60000000000002]
["0098","Abbott Memorial","00980005",null,"K - 08","TA",84,null,"ESMS",31,49.6]
["0099","Mabelle M Burrell","00990015",null,"PK - 04","NT",313,null,"ES",47,51.2]
["0099","Vincent M Igo Elementary","00990020",null,"K - 04","TA",365,null,"ES",87,139.20000000000002]
["0099","Charles Taylor Elementary","00990050",null,"K - 04","NT",253,null,"ES",41,65.600000000000009]
["0099","John J Ahern","00990405",null,"05 - 08","NT",767,null,"MS",143,228.8]
["0099","Foxborough High","00990505",null,"09 - 12","NT",769,null,"HS",143,216]
["0100","Juniper Hill School","01000001",null,"PK","NT",218,null,"EES",90,0]
["0100","King Elementary School","01000005",null,"K - 05","NT",366,null,"ES",117,187.20000000000002]
["0100","Brophy","01000006",null,"K - 05","SW",456,null,"ES",276,441.6]
["0100","Charlotte A Dunning","01000007",null,"K - 05","NT",413,null,"ES",132,211.20000000000002]
["0100","Hemenway","01000015",null,"K - 05","NT",515,null,"ES",139,222.4]
["0100","Barbieri Elementary","01000035",null,"K - 05","SW",665,null,"ES",370,592]
["0100","Potter Road","01000039",null,"K - 05","NT",512,null,"ES",192,307.20000000000005]
["0100","Mary E Stapleton Elementary","01000045",null,"K - 05","SW",313,null,"ES",158,252.8]
["0100","Miriam F McCarthy School","01000050",null,"K - 05","SW",484,null,"ES",290,464]
["0100","Woodrow Wilson","01000055",null,"K - 05","SW",479,null,"ES",342,547.20000000000005]
["0100","Cameron Middle School","01000302",null,"06 - 08","SW",565,null,"MS",285,456]
["0100","Fuller Middle","01000305",null,"06 - 08","SW",555,null,"MS",353,564.80000000000007]
["0100","Walsh Middle","01000310",null,"06 - 08","NT",763,null,"MS",242,387.20000000000005]
["0100","Framingham High School","01000515",null,"09 - 12","NT",2368,null,"HS",963,1540.8000000000002]
["0101","Franklin Early Childhood Development Center","01010003",null,"PK","NT",88,null,"EES",12,0]
["0101","Jefferson Elementary","01010010",null,"K - 05","NT",329,null,"ES",31,49.6]
["0101","Helen Keller Elementary","01010012",null,"K - 05","NT",325,null,"ES",29,46.400000000000006]
["0101","J F Kennedy Memorial","01010013",null,"K - 05","NT",330,null,"ES",26,41.6]
["0101","Oak Street Elementary","01010030",null,"K - 05","NT",366,null,"ES",46,73.600000000000009]
["0101","Parmenter","01010032",null,"K - 05","TA",305,null,"ES",86,137.6]
["0101","Davis Thayer","01010035",null,"K - 05","TA",211,null,"ES",43,68.8]
["0101","Annie Sullivan Middle School","01010040",null,"06 - 08","NT",344,null,"MS",47,75.2]
["0101","Remington Middle","01010310",null,"06 - 08","NT",379,null,"MS",62,99.2]
["0101","Horace Mann","01010405",null,"06 - 08","NT",413,null,"MS",35,56]
["0101","Franklin High","01010505",null,"09 - 12","NT",1731,null,"HS",135,206.4]
["0103","Elm Street School","01030001",null,"02 - 04","SW",438,null,"ES",276,441.6]
["0103","Waterford Street","01030020",null,"PK - 01","SW",389,null,"EES",244,316.8]
["0103","Gardner Middle School","01030405",null,"05 - 07","SW",549,null,"MS",310,496]
["0103","Gardner High","01030505",null,"08 - 12","NT",717,null,"MSHS/K-12",370,579.20000000000005]
["0103","Gardner Academy for Learning and Technology","01030515",null,"09 - 12","NT",123,null,"HS",66,105.60000000000001]
["0105","Perley Elementary","01050005",null,"PK","NT",21,null,"EES",5,0]
["0105","Penn Brook","01050010",null,"K - 06","TA",658,null,"ES",66,105.60000000000001]
["0105","Georgetown Middle School","01050305",null,"07 - 08","NT",204,null,"MS",26,41.6]
["0105","Georgetown High School","01050505",null,"09 - 12","NT",339,null,"HS",40,64]
["0107","Beeman Memorial","01070010",null,"K - 05","SW",308,null,"ES",171,273.60000000000002]
["0107","East Gloucester Elementary","01070020",null,"K - 05","SW",188,null,"ES",69,110.4]
["0107","Gloucester PreSchool","01070025",null,"PK","NT",90,null,"EES",39,0]
["0107","Plum Cove School","01070042",null,"K - 05","SW",207,null,"ES",58,92.800000000000011]
["0107","Veterans Memorial","01070045",null,"K - 05","SW",207,null,"ES",128,204.8]
["0107","West Parish","01070050",null,"K - 05","SW",359,null,"ES",135,216]
["0107","Ralph B O'Maley Middle","01070305",null,"06 - 08","NT",603,null,"MS",256,409.6]
["0107","Gloucester High","01070505",null,"09 - 12","NT",807,null,"HS",294,464]
["0109","Cuttyhunk Elementary","01090005",null,"02 - 07","NT",8,null,"ESMS",0,0]
["0110","South Grafton Elementary","01100005",null,"PK - 01","NT",279,null,"EES",37,46.400000000000006]
["0110","North Grafton Elementary","01100025",null,"PK - 01","NT",263,null,"EES",48,60.800000000000004]
["0110","North Street Elementary School","01100030",null,"02 - 06","TA",564,null,"ES",93,148.80000000000001]
["0110","Millbury Street Elementary School","01100200",null,"02 - 06","TA",630,null,"ES",96,153.60000000000002]
["0110","Grafton Middle","01100305",null,"07 - 08","NT",510,null,"MS",82,131.20000000000002]
["0110","Grafton High School","01100505",null,"09 - 12","NT",871,null,"HS",123,190.4]
["0111","East Meadow","01110004",null,"PK - 06","TA",385,null,"ES",144,222.4]
["0111","Granby Jr Sr High School","01110505",null,"07 - 12","NT",323,null,"MSHS/K-12",90,144]
["0114","The Academy of Early Learning at North Parish","01140005",null,"PK","NT",54,null,"EES",34,0]
["0114","Federal Street School","01140010",null,"K - 04","SW",206,null,"ES",138,220.8]
["0114","Discovery School at Four Corners","01140025",null,"K - 04","SW",217,null,"ES",71,113.60000000000001]
["0114","Newton School","01140035",null,"K - 04","SW",217,null,"ES",159,254.4]
["0114","Greenfield Middle","01140305",null,"05 - 07","SW",361,null,"MS",206,329.6]
["0114","Greenfield High","01140505",null,"08 - 12","SW",476,null,"MSHS/K-12",234,374.40000000000003]
["0117","Hadley Elementary","01170015",null,"PK - 06","TA",253,null,"ES",65,94.4]
["0117","Hopkins Academy","01170505",null,"07 - 12","NT",254,null,"MSHS/K-12",53,84.800000000000011]
["0118","Halifax Elementary","01180005",null,"K - 06","TA",566,null,"ES",126,201.60000000000002]
["0121","Hancock Elementary","01210005",null,"PK - 06","NT",55,null,"ES",18,24]
["0122","Cedar Elementary","01220004",null,"PK - 01","NT",482,null,"EES",43,52.800000000000004]
["0122","Center Elementary","01220005",null,"02 - 04","NT",583,null,"ES",43,68.8]
["0122","Hanover Middle","01220305",null,"05 - 08","TA",808,null,"MS",88,140.80000000000001]
["0122","Hanover High","01220505",null,"09 - 12","NT",758,null,"HS",73,113.60000000000001]
["0125","Hildreth Elementary School","01250005",null,"PK - 05","TA",414,null,"ES",23,33.6]
["0125","Bromfield","01250505",null,"06 - 12","TA",595,null,"MSHS/K-12",46,73.600000000000009]
["0127","Hatfield Elementary","01270005",null,"PK - 06","TA",217,null,"ES",41,59.2]
["0127","Smith Academy","01270505",null,"07 - 12","NT",179,null,"MSHS/K-12",18,28.8]
["0128","Bradford Elementary","01280008",null,"K - 04","SW",514,null,"ES",306,489.6]
["0128","Golden Hill","01280026",null,"K - 04","SW",491,null,"ES",313,500.8]
["0128","Caleb Dustin Hunking School","01280030",null,"K - 08","SW",1073,null,"ESMS",453,724.80000000000007]
["0128","Greenleaf Academy","01280033",null,"06 - 12","SW",33,null,"MSHS/K-12",27,43.2]
["0128","Moody","01280045",null,"PK","NT",202,null,"EES",117,0]
["0128","Dr Paul Nettle","01280050",null,"05 - 08","SW",587,null,"MS",372,595.20000000000005]
["0128","Pentucket Lake Elementary","01280054",null,"K - 04","SW",531,null,"ES",324,518.4]
["0128","Silver Hill Elementary School","01280067",null,"K - 05","SW",571,null,"ES",297,475.20000000000005]
["0128","TEACH","01280073",null,"01 - 08,10 - 12","SW",29,null,"MSHS/K-12",23,30.400000000000002]
["0128","Tilton","01280075",null,"K - 03","SW",369,null,"ES",260,416]
["0128","Walnut Square","01280080",null,"K - 02","SW",128,null,"EES",67,107.2]
["0128","John G Whittier","01280085",null,"05 - 08","SW",516,null,"MS",253,404.8]
["0128","Consentino Middle School","01280100",null,"05 - 08","SW",711,null,"MS",446,713.6]
["0128","Tilton Upper Middle School","01280105",null,"04 - 05","SW",183,null,"ES",128,204.8]
["0128","Haverhill High","01280505",null,"09 - 12","SW",1857,null,"HS",880,1379.2]
["0128","Crowell","01280515",null,"09 - 12","NT",26,null,"HS",24,38.400000000000006]
["0131","East Elementary School","01310005",null,"PK - 05","TA",410,null,"ES",24,30.400000000000002]
["0131","Wm L Foster Elementary","01310010",null,"K - 05","TA",436,null,"ES",31,49.6]
["0131","Plymouth River","01310019",null,"K - 05","TA",357,null,"ES",25,40]
["0131","South Elementary","01310020",null,"K - 05","TA",478,null,"ES",20,32]
["0131","Hingham Middle School","01310410",null,"06 - 08","TA",920,null,"MS",63,100.80000000000001]
["0131","Hingham High","01310505",null,"09 - 12","NT",1279,null,"HS",93,147.20000000000002]
["0133","John F Kennedy","01330018",null,"PK - 05","SW",679,null,"ES",238,356.8]
["0133","Holbrook Middle High School","01330505",null,"06 - 12","SW",588,null,"MSHS/K-12",218,342.40000000000003]
["0135","Holland Elementary","01350005",null,"PK - 06","TA",199,null,"ES",62,91.2]
["0136","Miller School","01360007",null,"03 - 05","NT",663,null,"ES",59,94.4]
["0136","Placentino Elementary","01360010",null,"PK - 02","TA",609,null,"EES",39,51.2]
["0136","Robert H. Adams Middle School","01360305",null,"06 - 08","NT",676,null,"MS",72,115.2]
["0136","Holliston High","01360505",null,"09 - 12","NT",809,null,"HS",60,91.2]
["0137","Joseph Metcalf School","01370003",null,"PK - 06","SW",295,null,"ES",176,246.4]
["0137","Lt Elmer J McMahon Elementary","01370015",null,"PK - 08","SW",358,null,"ESMS",260,396.8]
["0137","Morgan Full Service Community School","01370025",null,"PK - 04","SW",279,null,"ES",262,326.40000000000003]
["0137","William R. Peck School","01370030",null,"04 - 08","SW",260,null,"ESMS",244,390.40000000000003]
["0137","Kelly Elementary","01370040",null,"PK - 04,08","SW",340,null,"ESMS",319,488]
["0137","E N White Elementary","01370045",null,"PK - 05","SW",433,null,"ES",305,409.6]
["0137","Lt Clayre Sullivan Elementary","01370055",null,"PK - 08","SW",464,null,"ESMS",391,593.6]
["0137","Maurice A Donahue Elementary","01370060",null,"PK - 05,07 - 08","SW",428,null,"ESMS",382,564.80000000000007]
["0137","H.B. Lawrence School","01370070",null,"K - 03","SW",185,null,"ES",175,280]
["0137","Veritas Prep Holyoke","01370075",null,"05 - 07","SW",329,null,"MS",304,486.40000000000003]
["0137","Holyoke STEM Academy","01370320",null,"06 - 08","SW",252,null,"MS",206,329.6]
["0137","Holyoke High","01370505",null,"09 - 12","SW",1598,null,"HS",1214,1942.4]
["0138","Park Street School","01380003",null,"PK","NT",82,null,"EES",16,0]
["0138","Memorial","01380010",null,"K - 06","TA",533,null,"ES",84,134.4]
["0138","Hopedale Jr Sr High","01380505",null,"07 - 12","NT",485,null,"MSHS/K-12",86,137.6]
["0139","Hopkinton Pre-School","01390003",null,"PK","NT",80,null,"EES",7,0]
["0139","Marathon Elementary School","01390005",null,"K - 01","TA",545,null,"EES",34,54.400000000000006]
["0139","Elmwood","01390010",null,"02 - 03","TA",585,null,"ES",39,62.400000000000006]
["0139","Hopkins Elementary School","01390015",null,"04 - 05","TA",615,null,"ES",37,59.2]
["0139","Hopkinton Middle School","01390305",null,"06 - 08","TA",920,null,"MS",64,102.4]
["0139","Hopkinton High","01390505",null,"09 - 12","NT",1200,null,"HS",80,120]
["0141","Mulready Elementary","01410007",null,"PK - 04","SW",244,null,"ES",69,107.2]
["0141","Forest Avenue Elementary","01410015",null,"K - 04","NT",317,null,"ES",82,131.20000000000002]
["0141","C A Farley","01410030",null,"PK - 04","SW",393,null,"ES",122,190.4]
["0141","David J. Quinn Middle School","01410410",null,"05 - 07","NT",575,null,"MS",182,291.2]
["0141","Hudson High","01410505",null,"08 - 12","NT",858,null,"MSHS/K-12",236,377.6]
["0142","Lillian M Jacobs","01420015",null,"PK - 05","SW",359,null,"ES",115,161.60000000000002]
["0142","Memorial Middle","01420305",null,"06 - 08","NT",184,null,"MS",64,102.4]
["0142","Hull High","01420505",null,"09 - 12","NT",259,null,"HS",84,134.4]
["0144","Paul F Doyon Memorial","01440007",null,"K - 05","NT",336,null,"ES",40,64]
["0144","Winthrop","01440015",null,"PK - 05","TA",363,null,"ES",88,128]
["0144","Ipswich Middle School","01440305",null,"06 - 08","NT",373,null,"MS",53,84.800000000000011]
["0144","Ipswich High","01440505",null,"09 - 12","NT",532,null,"HS",85,132.80000000000001]
["0145","Kingston Elementary","01450005",null,"K - 02","TA",422,null,"EES",86,137.6]
["0145","Kingston Intermediate","01450020",null,"03 - 06","TA",604,null,"ES",128,204.8]
["0149","Rollins Early Childhood Center","01490001",null,"PK - K","SW",182,null,"EES",150,110.4]
["0149","Lawlor Early Childhood Center","01490002",null,"K","SW",154,null,"EES",129,206.4]
["0149","John Breen School","01490003",null,"PK - K","SW",282,null,"EES",218,169.60000000000002]
["0149","South Lawrence East Elementary School","01490004",null,"01 - 05","SW",730,null,"ES",585,936]
["0149","Community Day Arlington","01490009",null,"K - 04","SW",599,null,"ES",509,814.40000000000009]
["0149","Lawrence Family Public Academy","01490011",null,"PK - K","SW",163,null,"EES",134,160]
["0149","Alexander B Bruce","01490015",null,"03 - 08","SW",470,null,"ESMS",396,633.6]
["0149","Arlington Middle School","01490017",null,"05 - 08","SW",594,null,"MS",507,811.2]
["0149","Robert Frost","01490018",null,"K - 04","SW",551,null,"ES",401,641.6]
["0149","James F Hennessey","01490020",null,"PK - 02","SW",301,null,"EES",239,276.8]
["0149","Gerard A. Guilmette","01490022",null,"01 - 04","SW",474,null,"ES",387,619.20000000000005]
["0149","Guilmette Middle School","01490025",null,"05 - 08","SW",506,null,"MS",420,672]
["0149","Parthum Middle School","01490027",null,"05 - 08","SW",604,null,"MS",450,720]
["0149","Francis M Leahy","01490040",null,"01 - 05","SW",437,null,"ES",377,603.20000000000005]
["0149","Oliver Partnership School","01490048",null,"01 - 05","SW",473,null,"ES",402,643.20000000000005]
["0149","UP Academy Oliver Middle School","01490049",null,"06 - 08","SW",335,null,"MS",267,427.20000000000005]
["0149","Edward F. Parthum","01490053",null,"K - 04","SW",655,null,"ES",489,782.40000000000009]
["0149","John K Tarbox","01490075",null,"01 - 05","SW",292,null,"ES",252,403.20000000000005]
["0149","Emily G Wetherbee","01490080",null,"K - 08","SW",565,null,"ESMS",432,691.2]
["0149","Spark Academy","01490085",null,"06 - 08","SW",479,null,"MS",381,609.6]
["0149","UP Academy Leonard Middle School","01490090",null,"06 - 08","SW",327,null,"MS",269,430.40000000000003]
["0149","Lawrence High School","01490515",null,"09 - 12","SW",3063,null,"HS",2329,3689.6000000000004]
["0149","Frost Middle School","01490525",null,"05 - 08","SW",549,null,"MS",377,603.20000000000005]
["0149","High School Learning Center","01490536",null,"09 - 12","SW",273,null,"HS",223,356.8]
["0149","School for Exceptional Studies","01490537",null,"01 - 12","SW",124,null,"MSHS/K-12",114,174.4]
["0149","RISE Academy","01490615",null,"09 - 12","SW",17,null,"HS",12,19.200000000000003]
["0150","Lee Elementary","01500025",null,"PK - 06","TA",338,null,"ES",141,212.8]
["0150","Lee Middle/High School","01500505",null,"07 - 12","NT",331,null,"MSHS/K-12",123,190.4]
["0151","Leicester Integrated Preschool","01510001",null,"PK","NT",32,null,"EES",14,0]
["0151","Leicester Elementary","01510005",null,"K - 04","SW",467,null,"ES",172,275.2]
["0151","Leicester Middle","01510015",null,"05 - 08","SW",431,null,"MS",140,224]
["0151","Leicester High","01510505",null,"09 - 12","NT",439,null,"HS",99,158.4]
["0152","Morris","01520015",null,"PK - 05","TA",301,null,"ES",57,86.4]
["0152","Lenox Memorial High","01520505",null,"06 - 12","NT",438,null,"MSHS/K-12",84,134.4]
["0153","Bennett","01530003",null,"PK","NT",56,null,"EES",27,0]
["0153","Lincoln School","01530005",null,"PK","NT",25,null,"EES",13,0]
["0153","Fall Brook","01530007",null,"K - 05","SW",579,null,"ES",262,419.20000000000005]
["0153","Frances Drake School","01530010",null,"K - 05","SW",504,null,"ES",284,454.40000000000003]
["0153","Johnny Appleseed","01530025",null,"K - 05","SW",644,null,"ES",298,476.8]
["0153","Northwest","01530030",null,"K - 05","SW",672,null,"ES",360,576]
["0153","Priest Street","01530040",null,"K","SW",85,null,"EES",44,70.400000000000006]
["0153","Samoset School","01530045",null,"06 - 08","SW",509,null,"MS",224,358.40000000000003]
["0153","Sky View Middle School","01530320",null,"06 - 08","SW",900,null,"MS",456,729.6]
["0153","Leominster High School","01530505",null,"09 - 12","SW",1090,null,"HS",458,732.80000000000007]
["0153","Leominster Center for Excellence","01530515",null,"09 - 12","SW",42,null,"HS",25,40]
["0153","Center For Technical Education Innovation","01530605",null,"09 - 12","SW",742,null,"HS",333,532.80000000000007]
["0154","Leverett Elementary","01540005",null,"K - 06","NT",113,null,"ES",22,35.200000000000003]
["0155","Lexington Children's Place","01550001",null,"PK","NT",61,null,"EES",15,0]
["0155","Bridge","01550006",null,"K - 05","TA",399,null,"ES",40,64]
["0155","Bowman","01550008",null,"K - 05","NT",457,null,"ES",20,32]
["0155","Joseph Estabrook","01550010",null,"K - 05","NT",526,null,"ES",29,46.400000000000006]
["0155","Fiske","01550015",null,"K - 05","NT",384,null,"ES",28,44.800000000000004]
["0155","Harrington","01550030",null,"K - 05","TA",440,null,"ES",36,57.6]
["0155","Maria Hastings","01550035",null,"K - 05","NT",572,null,"ES",40,64]
["0155","Jonas Clarke Middle","01550305",null,"06 - 08","NT",874,null,"MS",52,83.2]
["0155","Wm Diamond Middle","01550310",null,"06 - 08","NT",924,null,"MS",55,88]
["0155","Lexington High","01550505",null,"09 - 12","NT",2250,null,"HS",152,243.20000000000002]
["0157","Hanscom Primary","01570006",null,"PK - 03","TA",302,null,"ES",4,4.8000000000000007]
["0157","Lincoln School","01570025",null,"PK - 08","NT",531,null,"ESMS",83,126.4]
["0157","Hanscom Middle","01570305",null,"04 - 08","NT",231,null,"ESMS",2,3.2]
["0158","Shaker Lane Elementary","01580005",null,"PK - 02","TA",369,null,"EES",26,41.6]
["0158","Russell St Elementary","01580015",null,"03 - 05","TA",371,null,"ES",32,51.2]
["0158","Littleton Middle School","01580305",null,"06 - 08","NT",388,null,"MS",39,62.400000000000006]
["0158","Littleton High School","01580505",null,"09 - 12","NT",437,null,"HS",41,62.400000000000006]
["0159","Blueberry Hill","01590005",null,"K - 05","NT",397,null,"ES",29,46.400000000000006]
["0159","Center","01590010",null,"K - 05","NT",402,null,"ES",42,67.2]
["0159","Glenbrook Middle","01590017",null,"06 - 08","TA",334,null,"MS",49,78.400000000000006]
["0159","Wolf Swamp Road","01590025",null,"PK - 05","TA",395,null,"ES",67,88]
["0159","Williams Middle","01590305",null,"06 - 08","NT",335,null,"MS",30,48]
["0159","Longmeadow High","01590505",null,"09 - 12","NT",898,null,"HS",78,124.80000000000001]
["0160","Cardinal O'Connell Early Learning Center","01600001",null,"PK","NT",81,null,"EES",51,0]
["0160","Dr Gertrude Bailey","01600002",null,"PK - 04","SW",462,null,"ES",247,380.8]
["0160","Rogers STEM Academy","01600005",null,"K - 08","SW",857,null,"ESMS",636,1017.6]
["0160","Joseph McAvinnue","01600010",null,"PK - 04","SW",443,null,"ES",331,508.8]
["0160","Greenhalge","01600015",null,"PK - 04","SW",462,null,"ES",364,544]
["0160","Pyne Arts","01600018",null,"PK - 08","SW",463,null,"ESMS",221,337.6]
["0160","Abraham Lincoln","01600020",null,"PK - 04","SW",473,null,"ES",347,532.80000000000007]
["0160","Moody Elementary","01600027",null,"K - 04","SW",220,null,"ES",169,270.40000000000003]
["0160","Charles W Morey","01600030",null,"PK - 04","SW",473,null,"ES",247,361.6]
["0160","Pawtucketville Memorial","01600036",null,"PK - 04","SW",460,null,"ES",246,374.40000000000003]
["0160","Peter W Reilly","01600040",null,"PK - 04","SW",448,null,"ES",239,364.8]
["0160","John J Shaughnessy","01600050",null,"PK - 04","SW",453,null,"ES",303,467.20000000000005]
["0160","Washington","01600055",null,"PK - 04","SW",236,null,"ES",156,228.8]
["0160","S Christa McAuliffe Elementary","01600075",null,"PK - 04","SW",477,null,"ES",346,518.4]
["0160","Charlotte M Murkland Elementary","01600080",null,"PK - 04","SW",467,null,"ES",366,544]
["0160","Laura Lee Therapeutic Day School","01600085",null,"04 - 08","SW",23,null,"ESMS",19,30.400000000000002]
["0160","Bartlett Community Partnership","01600090",null,"PK - 08","SW",470,null,"ESMS",318,476.8]
["0160","B.F. Butler Middle School","01600310",null,"05 - 08","SW",548,null,"MS",348,556.80000000000007]
["0160","James S Daley Middle School","01600315",null,"05 - 08","SW",689,null,"MS",345,552]
["0160","Leblanc Therapeutic Day School","01600320",null,"08 - 12","SW",37,null,"HS",34,54.400000000000006]
["0160","Henry J Robinson Middle","01600330",null,"05 - 08","SW",648,null,"MS",496,793.6]
["0160","James Sullivan Middle School","01600340",null,"05 - 08","SW",643,null,"MS",422,675.2]
["0160","Dr An Wang School","01600345",null,"05 - 08","SW",662,null,"MS",399,638.40000000000009]
["0160","Kathryn P. Stoklosa Middle School","01600360",null,"05 - 08","SW",651,null,"MS",469,750.40000000000009]
["0160","Lowell High","01600505",null,"09 - 12","SW",2976,null,"HS",1735,2756.8]
["0160","The Career Academy","01600515",null,"09 - 12","SW",109,null,"HS",92,147.20000000000002]
["0160","Dr. Janice Adie Day School","01600605",null,"PK - 09,11","SW",51,null,"ESMS",32,48]
["0161","East Street Elementary School","01610010",null,"PK - 01","TA",337,null,"EES",120,163.20000000000002]
["0161","Chapin Street Elementary School","01610020",null,"02 - 03","TA",298,null,"ES",105,168]
["0161","Veterans Park Elementary","01610023",null,"04 - 05","SW",329,null,"ES",111,177.60000000000002]
["0161","Paul R Baird Middle","01610305",null,"06 - 08","NT",583,null,"MS",204,326.40000000000003]
["0161","Ludlow Senior High","01610505",null,"09 - 12","NT",831,null,"HS",214,342.40000000000003]
["0162","Lunenburg Primary School","01620010",null,"PK - 02","TA",375,null,"EES",101,140.80000000000001]
["0162","Turkey Hill Elementary School","01620025",null,"03 - 05","TA",343,null,"ES",71,113.60000000000001]
["0162","Lunenburg Middle School","01620305",null,"06 - 08","NT",383,null,"MS",82,131.20000000000002]
["0162","Lunenburg High","01620505",null,"09 - 12","NT",468,null,"HS",78,124.80000000000001]
["0162","Advanced Community Experience Program","01620605",null,null,"NT",3,null,"SP",2]
["0163","Washington Elementary School","01630005",null,"PK - 05","SW",448,null,"ES",348,537.6]
["0163","Aborn","01630011",null,"K - 05","SW",232,null,"ES",116,185.60000000000002]
["0163","A Drewicz Elementary","01630016",null,"PK - 05","SW",463,null,"ES",322,508.8]
["0163","Brickett Elementary","01630020",null,"K - 05","SW",330,null,"ES",247,395.20000000000005]
["0163","Julia F Callahan","01630030",null,"PK - 05","SW",375,null,"ES",230,328]
["0163","Cobbet Elementary","01630035",null,"K - 05","SW",622,null,"ES",489,782.40000000000009]
["0163","Wm P Connery","01630040",null,"PK - 05","SW",564,null,"ES",438,689.6]
["0163","E J Harrington","01630045",null,"PK - 05","SW",635,null,"ES",504,758.40000000000009]
["0163","Robert L Ford","01630050",null,"01 - 05","SW",480,null,"ES",333,532.80000000000007]
["0163","Hood","01630055",null,"PK - 05","SW",494,null,"ES",326,499.20000000000005]
["0163","Ingalls","01630060",null,"K - 05","SW",683,null,"ES",502,803.2]
["0163","Lincoln-Thomson","01630070",null,"K - 05","SW",206,null,"ES",120,192]
["0163","Lynn Woods","01630075",null,"K - 05","SW",151,null,"ES",62,99.2]
["0163","William R Fallon","01630080",null,"01 - 05","SW",33,null,"ES",29,46.400000000000006]
["0163","Sewell-Anderson","01630085",null,"K - 05","SW",273,null,"ES",150,240]
["0163","Capt William G Shoemaker","01630090",null,"PK - 05","SW",308,null,"ES",134,211.20000000000002]
["0163","Edward A Sisson","01630095",null,"PK - 05","SW",434,null,"ES",217,328]
["0163","Tracy","01630100",null,"01 - 05","SW",425,null,"ES",324,518.4]
["0163","Thurgood Marshall Mid","01630305",null,"06 - 08","SW",1305,null,"MS",916,1465.6000000000001]
["0163","Breed Middle School","01630405",null,"06 - 08","SW",1323,null,"MS",880,1408]
["0163","Pickering Middle","01630420",null,"06 - 08","SW",588,null,"MS",273,436.8]
["0163","Classical High","01630505",null,"09 - 12","SW",1642,null,"HS",1023,1636.8000000000002]
["0163","Lynn English High","01630510",null,"09 - 12","SW",2000,null,"HS",1270,2032]
["0163","Fecteau-Leary Junior/Senior High School","01630525",null,"06 - 12","SW",95,null,"MSHS/K-12",75,120]
["0163","Lynn Vocational Technical Institute","01630605",null,"PK - 04,08 - 12","SW",1450,null,"MSHS/K-12",913,1372.8000000000002]
["0164","Lynnfield Preschool","01640005",null,"PK","NT",30,null,"EES",4,0]
["0164","Huckleberry Hill","01640010",null,"K - 04","TA",452,null,"ES",61,97.600000000000009]
["0164","Summer Street","01640020",null,"K - 04","NT",392,null,"ES",18,28.8]
["0164","Lynnfield Middle School","01640405",null,"05 - 08","NT",697,null,"MS",60,96]
["0164","Lynnfield High","01640505",null,"09 - 12","NT",601,null,"HS",66,105.60000000000001]
["0165","Beebe","01650003",null,"K - 08","SW",888,null,"ESMS",473,756.80000000000007]
["0165","Ferryway","01650013",null,"K - 08","SW",904,null,"ESMS",511,817.6]
["0165","Forestdale","01650027",null,"K - 08","SW",555,null,"ESMS",262,419.20000000000005]
["0165","Linden","01650047",null,"K - 08","SW",801,null,"ESMS",362,579.20000000000005]
["0165","Malden Early Learning Center","01650049",null,"PK","NT",245,null,"EES",99,0]
["0165","Salemwood","01650057",null,"K - 08","SW",982,null,"ESMS",651,1041.6000000000001]
["0165","Malden High","01650505",null,"09 - 12","NT",1715,null,"HS",900,1414.4]
["0167","Roland Green School","01670003",null,"PK","NT",94,null,"EES",24,0]
["0167","Everett W Robinson","01670007",null,"K - 02","TA",663,null,"EES",129,206.4]
["0167","Jordan/Jackson Elementary","01670014",null,"03 - 05","NT",752,null,"ES",137,219.20000000000002]
["0167","Harold L Qualters Middle","01670035",null,"06 - 08","NT",803,null,"MS",138,220.8]
["0167","Mansfield High","01670505",null,"09 - 12","NT",1194,null,"HS",174,270.40000000000003]
["0168","L H Coffin","01680010",null,"01 - 02","NT",181,null,"EES",26,41.6]
["0168","Village School","01680016",null,"03 - 06","TA",700,null,"ES",84,134.4]
["0168","Glover","01680020",null,"PK - 03","NT",342,null,"ES",37,43.2]
["0168","Dr. Samuel C. Eveleth","01680025",null,"K","NT",65,null,"EES",5,8]
["0168","Marblehead Veterans Middle School","01680300",null,"07 - 08","NT",451,null,"MS",49,78.400000000000006]
["0168","Marblehead High","01680505",null,"09 - 12","NT",946,null,"HS",112,172.8]
["0169","Sippican","01690005",null,"PK - 06","TA",398,null,"ES",103,152]
["0170","Early Childhood Center","01700006",null,"PK","NT",193,null,"EES",88,0]
["0170","Francis J Kane","01700008",null,"K - 05","SW",480,null,"ES",208,332.8]
["0170","Goodnow Brothers Elementary School","01700020",null,"K - 05","NT",714,null,"ES",324,518.4]
["0170","Richer","01700025",null,"K - 05","SW",493,null,"ES",248,396.8]
["0170","Charles Jaworek School","01700030",null,"K - 05","SW",665,null,"ES",331,529.6]
["0170","1 LT Charles W. Whitcomb School","01700045",null,"06 - 08","SW",1133,null,"MS",550,880]
["0170","Marlborough High","01700505",null,"09 - 12","NT",992,null,"HS",441,694.40000000000009]
["0171","Eames Way School","01710005",null,"K - 05","NT",215,null,"ES",18,28.8]
["0171","South River","01710010",null,"K - 05","NT",288,null,"ES",32,51.2]
["0171","Daniel Webster","01710015",null,"PK - 05","TA",354,null,"ES",82,115.2]
["0171","Gov Edward Winslow","01710020",null,"K - 05","NT",379,null,"ES",44,70.400000000000006]
["0171","Martinson Elementary","01710025",null,"PK - 05","TA",430,null,"ES",87,120]
["0171","Furnace Brook Middle","01710310",null,"06 - 08","TA",909,null,"MS",135,216]
["0171","Marshfield High","01710505",null,"09 - 12","NT",1220,null,"HS",169,270.40000000000003]
["0172","Kenneth Coombs School","01720005",null,"PK - 02","TA",334,null,"EES",138,179.20000000000002]
["0172","Mashpee Middle School","01720020",null,"07 - 08","NT",251,null,"MS",95,152]
["0172","Quashnet School","01720035",null,"03 - 06","TA",445,null,"ES",165,264]
["0172","Mashpee High","01720505",null,"09 - 12","NT",437,null,"HS",126,201.60000000000002]
["0173","Center","01730005",null,"PK - 03","NT",238,null,"ES",48,68.8]
["0173","Old Hammondtown","01730010",null,"04 - 06","TA",172,null,"ES",29,46.400000000000006]
["0174","Green Meadow","01740010",null,"PK - 03","TA",412,null,"ES",90,128]
["0174","Fowler School","01740305",null,"04 - 08","TA",457,null,"ESMS",100,160]
["0174","Maynard High","01740505",null,"09 - 12","NT",304,null,"HS",50,80]
["0175","Memorial School","01750003",null,"PK - 01","NT",399,null,"EES",27,41.6]
["0175","Dale Street","01750005",null,"04 - 05","NT",402,null,"ES",27,43.2]
["0175","Ralph Wheelock School","01750007",null,"02 - 03","NT",380,null,"ES",28,44.800000000000004]
["0175","Thomas Blake Middle","01750305",null,"06 - 08","NT",555,null,"MS",27,43.2]
["0175","Medfield Senior High","01750505",null,"09 - 12","NT",767,null,"HS",48,76.800000000000011]
["0176","John J McGlynn Elementary School","01760068",null,"PK - 05","TA",439,null,"ES",207,323.20000000000005]
["0176","Brooks School","01760130",null,"PK - 05","NT",493,null,"ES",85,115.2]
["0176","Christopher Columbus","01760140",null,"PK - 05","TA",381,null,"ES",161,251.20000000000002]
["0176","Milton Fuller Roberts","01760150",null,"PK - 05","TA",482,null,"ES",135,206.4]
["0176","Madeleine Dugger Andrews","01760315",null,"06 - 08","NT",445,null,"MS",137,219.20000000000002]
["0176","John J. McGlynn Middle School","01760320",null,"06 - 08","NT",443,null,"MS",202,323.20000000000005]
["0176","Medford High","01760505",null,"09 - 12","NT",1244,null,"HS",432,681.6]
["0176","Curtis-Tufts","01760510",null,"09 - 12","NT",16,null,"HS",12,19.200000000000003]
["0177","John D Mc Govern Elementary","01770013",null,"PK - 01","TA",326,null,"EES",44,59.2]
["0177","Burke/Memorial Elementary School","01770015",null,"02 - 04","TA",443,null,"ES",55,88]
["0177","Medway Middle","01770305",null,"05 - 08","NT",685,null,"MS",85,136]
["0177","Medway High","01770505",null,"09 - 12","NT",632,null,"HS",69,110.4]
["0178","Early Childhood Center","01780003",null,"PK - K","NT",169,null,"EES",24,17.600000000000001]
["0178","Herbert Clark Hoover","01780017",null,"K - 05","TA",302,null,"ES",47,75.2]
["0178","Lincoln","01780020",null,"K - 05","TA",392,null,"ES",101,161.60000000000002]
["0178","Horace Mann","01780025",null,"K - 05","NT",268,null,"ES",11,17.600000000000001]
["0178","Roosevelt","01780035",null,"K - 05","TA",410,null,"ES",49,78.400000000000006]
["0178","Winthrop","01780050",null,"K - 05","NT",392,null,"ES",18,28.8]
["0178","Melrose Middle","01780305",null,"06 - 08","NT",816,null,"MS",124,198.4]
["0178","Melrose High","01780505",null,"09 - 12","NT",922,null,"HS",111,174.4]
["0181","Marsh Grammar School","01810030",null,"PK - 08","SW",1137,null,"ESMS",416,648]
["0181","Comprehensive Grammar School","01810050",null,"PK - 08","SW",1012,null,"ESMS",407,635.20000000000005]
["0181","Tenney Grammar School","01810055",null,"PK - 08","SW",1289,null,"ESMS",709,1108.8]
["0181","Donald P Timony Grammar","01810060",null,"PK - 08","SW",1213,null,"ESMS",581,899.2]
["0181","Methuen High","01810505",null,"09 - 12","TA",1918,null,"HS",755,1201.6000000000001]
["0182","Henry B. Burkland Elementary School","01820008",null,"01 - 05","SW",524,null,"ES",245,392]
["0182","Mary K. Goode Elementary School","01820010",null,"01 - 05","SW",557,null,"ES",165,264]
["0182","Memorial Early Childhood Center","01820011",null,"PK - K","SW",253,null,"EES",98,129.6]
["0182","John T. Nichols Middle","01820305",null,"06 - 08","SW",744,null,"MS",259,414.40000000000003]
["0182","Middleborough High","01820505",null,"09 - 12","NT",827,null,"HS",206,324.8]
["0184","Fuller Meadow","01840003",null,"K - 02","TA",282,null,"EES",25,40]
["0184","Howe-Manning","01840005",null,"PK,03 - 06","NT",397,null,"ES",40,57.6]
["0185","Memorial","01850010",null,"K - 02","SW",435,null,"EES",231,369.6]
["0185","Brookside","01850065",null,"K - 02","SW",454,null,"EES",238,380.8]
["0185","Shining Star Early Childhood Center","01850075",null,"PK","NT",106,null,"EES",44,0]
["0185","Woodland","01850090",null,"03 - 05","SW",970,null,"ES",460,736]
["0185","Stacy Middle","01850305",null,"06 - 08","NT",1031,null,"MS",459,734.40000000000009]
["0185","Milford High","01850505",null,"09 - 12","NT",1225,null,"HS",491,771.2]
["0186","Elmwood Street","01860017",null,"PK - 03","SW",512,null,"ES",149,217.60000000000002]
["0186","Raymond E. Shaw Elementary","01860025",null,"04 - 06","SW",339,null,"ES",105,168]
["0186","Millbury Junior/Senior High","01860505",null,"07 - 12","NT",726,null,"MSHS/K-12",212,337.6]
["0187","Clyde F Brown","01870005",null,"PK - 05","TA",559,null,"ES",81,124.80000000000001]
["0187","Millis Middle","01870020",null,"06 - 08","NT",274,null,"MS",39,62.400000000000006]
["0187","Millis High School","01870505",null,"09 - 12","NT",332,null,"HS",48,76.800000000000011]
["0189","Collicot","01890005",null,"K - 05","NT",606,null,"ES",34,54.400000000000006]
["0189","Cunningham School","01890007",null,"PK - 05","NT",619,null,"ES",55,65.600000000000009]
["0189","Glover","01890010",null,"K - 05","NT",594,null,"ES",58,92.800000000000011]
["0189","Tucker","01890020",null,"PK - 05","TA",437,null,"ES",92,134.4]
["0189","Charles S Pierce Middle","01890410",null,"06 - 08","NT",951,null,"MS",112,179.20000000000002]
["0189","Milton High","01890505",null,"09 - 12","NT",1121,null,"HS",170,260.8]
["0191","Quarry Hill Community School","01910010",null,"PK - K","NT",98,null,"EES",26,27.200000000000003]
["0191","Granite Valley School","01910030",null,"01 - 06","TA",408,null,"ES",151,241.60000000000002]
["0191","Monson High School","01910505",null,"07 - 12","NT",342,null,"MSHS/K-12",96,150.4]
["0196","Johnson","01960010",null,"PK - 06","TA",151,null,"ES",35,51.2]
["0197","Nantucket Elementary","01970005",null,"PK - 02","TA",378,null,"EES",117,160]
["0197","Cyrus Peirce","01970010",null,"06 - 08","TA",421,null,"MS",119,190.4]
["0197","Nantucket Intermediate School","01970020",null,"03 - 05","TA",313,null,"ES",100,160]
["0197","Nantucket High","01970505",null,"09 - 12","NT",525,null,"HS",144,225.60000000000002]
["0198","Bennett-Hemenway","01980005",null,"K - 04","NT",513,null,"ES",40,64]
["0198","Brown","01980010",null,"K - 04","TA",471,null,"ES",64,102.4]
["0198","Johnson","01980031",null,"K - 04","TA",212,null,"ES",32,51.2]
["0198","Lilja Elementary","01980035",null,"K - 04","TA",373,null,"ES",49,78.400000000000006]
["0198","Memorial","01980043",null,"K - 04","NT",411,null,"ES",27,43.2]
["0198","J F Kennedy Middle School","01980305",null,"05 - 08","NT",802,null,"MS",84,134.4]
["0198","Wilson Middle","01980310",null,"05 - 08","NT",863,null,"MS",109,174.4]
["0198","Natick High","01980505",null,"PK,09 - 12","NT",1641,null,"HS",175,264]
["0199","Broadmeadow","01990005",null,"K - 05","NT",510,null,"ES",25,40]
["0199","John Eliot","01990020",null,"K - 05","TA",418,null,"ES",50,80]
["0199","Sunita L. Williams Elementary","01990035",null,"K - 05","NT",497,null,"ES",29,46.400000000000006]
["0199","William Mitchell","01990040",null,"K - 05","NT",464,null,"ES",29,46.400000000000006]
["0199","Newman Elementary","01990050",null,"PK - 05","NT",653,null,"ES",40,57.6]
["0199","Pollard Middle","01990405",null,"07 - 08","NT",896,null,"MS",69,110.4]
["0199","High Rock School","01990410",null,"06","NT",395,null,"MS",23,36.800000000000004]
["0199","Needham High","01990505",null,"09 - 12","NT",1668,null,"HS",90,142.4]
["0201","Charles S Ashley","02010010",null,"K - 05","SW",203,null,"ES",124,198.4]
["0201","Elizabeth Carter Brooks","02010015",null,"K - 05","SW",273,null,"ES",196,313.60000000000002]
["0201","Elwyn G Campbell","02010020",null,"PK - 05","SW",315,null,"ES",210,286.40000000000003]
["0201","James B Congdon","02010040",null,"K - 05","SW",314,null,"ES",243,388.8]
["0201","Sgt Wm H Carney Academy","02010045",null,"PK - 05","SW",650,null,"ES",524,756.80000000000007]
["0201","John B Devalles","02010050",null,"K - 05","SW",355,null,"ES",309,494.40000000000003]
["0201","Alfred J Gomes","02010063",null,"K - 05","SW",476,null,"ES",406,649.6]
["0201","Irwin M. Jacobs Elementary School","02010070",null,"PK - 05","SW",346,null,"ES",295,430.40000000000003]
["0201","Ellen R Hathaway","02010075",null,"PK - 05","SW",301,null,"ES",242,340.8]
["0201","Hayden/McFadden","02010078",null,"PK - 05","SW",636,null,"ES",547,819.2]
["0201","Abraham Lincoln","02010095",null,"K - 05","SW",701,null,"ES",543,868.80000000000007]
["0201","Carlos Pacheco","02010105",null,"PK - 05","SW",367,null,"ES",309,478.40000000000003]
["0201","John Avery Parker","02010115",null,"PK - 05","SW",209,null,"ES",172,252.8]
["0201","Casimir Pulaski","02010123",null,"PK - 05","SW",605,null,"ES",329,467.20000000000005]
["0201","Renaissance Community Innovation School","02010124",null,"PK - 05","SW",181,null,"ES",155,222.4]
["0201","Thomas R Rodman","02010125",null,"K - 05","SW",151,null,"ES",112,179.20000000000002]
["0201","Jireh Swift","02010130",null,"PK - 05","SW",156,null,"ES",98,134.4]
["0201","William H Taylor","02010135",null,"PK - 05","SW",252,null,"ES",147,212.8]
["0201","Betsey B Winslow","02010140",null,"K - 05","SW",196,null,"ES",101,161.60000000000002]
["0201","Keith Middle School","02010405",null,"06 - 08","SW",1024,null,"MS",762,1219.2]
["0201","Normandin Middle School","02010410",null,"06 - 08","SW",1123,null,"MS",748,1196.8]
["0201","Roosevelt Middle School","02010415",null,"06 - 08","SW",891,null,"MS",693,1108.8]
["0201","New Bedford High","02010505",null,"09 - 12","SW",2666,null,"HS",1952,3123.2000000000003]
["0201","Trinity Day Academy","02010510",null,"04 - 12","SW",98,null,"MSHS/K-12",89,142.4]
["0201","Whaling City Junior/Senior High School","02010515",null,"07 - 12","SW",92,null,"HS",82,131.20000000000002]
["0204","Francis T Bresnahan Elementary","02040005",null,"PK - 03","TA",541,null,"ES",69,105.60000000000001]
["0204","Edward G. Molin Elementary School","02040030",null,"04 - 05","NT",287,null,"ES",32,51.2]
["0204","Rupert A Nock Middle","02040305",null,"06 - 08","NT",490,null,"MS",52,83.2]
["0204","Newburyport High","02040505",null,"09 - 12","NT",797,null,"HS",92,144]
["0207","A E Angier","02070005",null,"K - 05","NT",428,null,"ES",28,44.800000000000004]
["0207","Bowen","02070015",null,"K - 05","NT",344,null,"ES",37,59.2]
["0207","C C Burr","02070020",null,"K - 05","TA",340,null,"ES",40,64]
["0207","Cabot","02070025",null,"K - 05","NT",384,null,"ES",42,67.2]
["0207","Countryside","02070040",null,"K - 05","TA",360,null,"ES",38,60.800000000000004]
["0207","Franklin","02070055",null,"K - 05","NT",377,null,"ES",39,62.400000000000006]
["0207","Lincoln-Eliot","02070070",null,"K - 05","TA",346,null,"ES",98,156.80000000000001]
["0207","Horace Mann","02070075",null,"K - 05","NT",372,null,"ES",40,64]
["0207","Mason-Rice","02070080",null,"K - 05","NT",365,null,"ES",6,9.6000000000000014]
["0207","Peirce","02070100",null,"K - 05","NT",237,null,"ES",21,33.6]
["0207","Memorial Spaulding","02070105",null,"K - 05","NT",398,null,"ES",31,49.6]
["0207","Newton Early Childhood Program","02070108",null,"PK","NT",168,null,"EES",23,0]
["0207","Underwood","02070115",null,"K - 05","TA",225,null,"ES",27,43.2]
["0207","John Ward","02070120",null,"K - 05","NT",214,null,"ES",7,11.200000000000001]
["0207","Williams","02070125",null,"K - 05","NT",245,null,"ES",16,25.6]
["0207","Zervas","02070130",null,"K - 05","NT",395,null,"ES",48,76.800000000000011]
["0207","Bigelow Middle","02070305",null,"06 - 08","NT",507,null,"MS",71,113.60000000000001]
["0207","Charles E Brown Middle","02070310",null,"06 - 08","NT",786,null,"MS",49,78.400000000000006]
["0207","F A Day Middle","02070315",null,"06 - 08","NT",947,null,"MS",102,163.20000000000002]
["0207","Oak Hill Middle","02070320",null,"06 - 08","NT",654,null,"MS",70,112]
["0207","Newton North High","02070505",null,"09 - 12","NT",2062,null,"HS",283,428.8]
["0207","Newton South High","02070510",null,"09 - 12","NT",1851,null,"HS",167,267.2]
["0208","Freeman-Kennedy School","02080005",null,"03 - 06","NT",517,null,"ES",41,65.600000000000009]
["0208","H Olive Day","02080015",null,"PK - 02","TA",474,null,"EES",23,32]
["0209","Colegrove Park Elementary","02090008",null,"PK - 06","SW",266,null,"ES",187,278.40000000000003]
["0209","Greylock","02090015",null,"PK - 06","SW",227,null,"ES",148,198.4]
["0209","Brayton","02090035",null,"PK - 06","SW",247,null,"ES",191,268.8]
["0209","Drury High","02090505",null,"07 - 12","NT",524,null,"MSHS/K-12",328,521.6]
["0210","Bridge Street","02100005",null,"PK - 05","SW",249,null,"ES",112,142.4]
["0210","Jackson Street","02100020",null,"K - 05","SW",320,null,"ES",80,128]
["0210","Leeds","02100025",null,"PK - 05","SW",285,null,"ES",81,105.60000000000001]
["0210","R. K. Finn Ryan Road","02100029",null,"K - 05","SW",233,null,"ES",68,108.80000000000001]
["0210","John F Kennedy Middle School","02100410",null,"06 - 08","SW",615,null,"MS",180,288]
["0210","Northampton High","02100505",null,"09 - 12","NT",857,null,"HS",190,302.40000000000003]
["0211","Atkinson","02110001",null,"01 - 05","TA",323,null,"ES",117,187.20000000000002]
["0211","Anne Bradstreet Early Childhood Center","02110005",null,"PK - K","NT",369,null,"EES",86,96]
["0211","Franklin","02110010",null,"01 - 05","NT",389,null,"ES",45,72]
["0211","Kittredge","02110015",null,"01 - 05","NT",226,null,"ES",20,32]
["0211","Annie L Sargent School","02110018",null,"01 - 05","NT",443,null,"ES",26,41.6]
["0211","Thomson","02110020",null,"01 - 05","TA",319,null,"ES",101,161.60000000000002]
["0211","North Andover Middle","02110305",null,"06 - 08","NT",1103,null,"MS",232,371.20000000000005]
["0211","North Andover High","02110505",null,"09 - 12","NT",1378,null,"HS",246,393.6]
["0212","Amvet Boulevard","02120007",null,"K - 05","NT",411,null,"ES",59,94.4]
["0212","Falls","02120010",null,"K - 05","NT",191,null,"ES",26,41.6]
["0212","Joseph W Martin Jr Elementary","02120013",null,"K - 05","NT",596,null,"ES",92,147.20000000000002]
["0212","Roosevelt Avenue","02120015",null,"K - 05","NT",207,null,"ES",30,48]
["0212","North Attleborough Early Learning Center","02120020",null,"PK","NT",170,null,"EES",50,0]
["0212","Community","02120030",null,"K - 05","SW",316,null,"ES",160,256]
["0212","North Attleborough Middle","02120305",null,"06 - 08","NT",992,null,"MS",192,307.20000000000005]
["0212","North Attleboro High","02120505",null,"09 - 12","NT",1088,null,"HS",211,337.6]
["0213","Lincoln Street","02130003",null,"K - 05","TA",266,null,"ES",45,72]
["0213","Marguerite E Peaslee","02130014",null,"K - 05","TA",269,null,"ES",30,48]
["0213","Fannie E Proctor","02130015",null,"K - 05","TA",245,null,"ES",52,83.2]
["0213","Marion E Zeh","02130020",null,"K - 05","TA",231,null,"ES",34,54.400000000000006]
["0213","Robert E. Melican Middle School","02130305",null,"06 - 08","TA",524,null,"MS",76,121.60000000000001]
["0214","W Edward Balmer","02140001",null,"02 - 04","SW",386,null,"ES",155,248]
["0214","Northbridge Elementary","02140005",null,"PK - 01","TA",365,null,"EES",136,177.60000000000002]
["0214","Northbridge Middle","02140305",null,"05 - 08","TA",656,null,"MS",230,368]
["0214","Northbridge High","02140505",null,"09 - 12","NT",533,null,"HS",145,232]
["0215","North Brookfield Elementary","02150015",null,"PK - 06","SW",298,null,"ES",113,169.60000000000002]
["0215","North Brookfield High","02150505",null,"07 - 12","NT",218,null,"MSHS/K-12",85,136]
["0217","E Ethel Little School","02170003",null,"PK - 05","TA",312,null,"ES",33,51.2]
["0217","L D Batchelder","02170005",null,"K - 05","NT",448,null,"ES",31,49.6]
["0217","J Turner Hood","02170010",null,"PK - 05","TA",348,null,"ES",43,60.800000000000004]
["0217","North Reading Middle","02170305",null,"06 - 08","TA",549,null,"MS",56,89.600000000000009]
["0217","North Reading High","02170505",null,"09 - 12","NT",658,null,"HS",56,89.600000000000009]
["0218","L G Nourse Elementary","02180010",null,"K - 03","SW",269,null,"ES",81,129.6]
["0218","J C Solmonese","02180015",null,"PK - 03","SW",479,null,"ES",110,139.20000000000002]
["0218","Henri A. Yelle","02180060",null,"04 - 05","TA",345,null,"ES",85,136]
["0218","Norton Middle","02180305",null,"06 - 08","NT",598,null,"MS",139,222.4]
["0218","Norton High","02180505",null,"09 - 12","NT",689,null,"HS",139,219.20000000000002]
["0219","Grace Farrar Cole","02190005",null,"PK - 05","NT",474,null,"ES",32,48]
["0219","William G Vinal","02190020",null,"PK - 05","NT",578,null,"ES",17,27.200000000000003]
["0219","Norwell Middle School","02190405",null,"06 - 08","NT",506,null,"MS",32,51.2]
["0219","Norwell High","02190505",null,"09 - 12","NT",648,null,"HS",35,56]
["0220","Balch","02200005",null,"01 - 05","TA",300,null,"ES",159,254.4]
["0220","Cornelius M Callahan","02200010",null,"01 - 05","TA",222,null,"ES",90,144]
["0220","F A Cleveland","02200015",null,"01 - 05","TA",319,null,"ES",82,131.20000000000002]
["0220","John P Oldham","02200020",null,"01 - 05","TA",243,null,"ES",75,120]
["0220","Charles J Prescott","02200025",null,"K - 05","NT",254,null,"ES",53,84.800000000000011]
["0220","George F. Willett","02200075",null,"PK - K","TA",369,null,"EES",97,104]
["0220","Dr. Philip O. Coakley Middle School","02200305",null,"06 - 08","NT",718,null,"MS",237,379.20000000000005]
["0220","Norwood High","02200505",null,"09 - 12","NT",970,null,"HS",264,416]
["0221","Oak Bluffs Elementary","02210005",null,"PK - 08","TA",418,null,"ESMS",136,214.4]
["0223","Dexter Park","02230010",null,"03 - 06","SW",267,null,"ES",162,259.2]
["0223","Fisher Hill","02230015",null,"PK - 02","SW",206,null,"EES",143,216]
["0224","Orleans Elementary","02240005",null,"K - 05","TA",170,null,"ES",51,81.600000000000009]
["0226","Clara Barton","02260005",null,"02 - 04","SW",351,null,"ES",138,220.8]
["0226","Alfred M Chaffee","02260010",null,"PK - 01","SW",195,null,"EES",73,99.2]
["0226","Oxford Middle","02260405",null,"05 - 07","SW",365,null,"MS",132,211.20000000000002]
["0226","Oxford High","02260505",null,"08 - 12","NT",543,null,"MSHS/K-12",212,326.40000000000003]
["0227","Old Mill Pond","02270008",null,"PK - 05","SW",588,null,"ES",314,478.40000000000003]
["0227","Palmer High","02270505",null,"06 - 12","SW",595,null,"MSHS/K-12",307,484.8]
["0229","Captain Samuel Brown","02290005",null,"K - 05","SW",346,null,"ES",113,180.8]
["0229","John E Burke","02290007",null,"K - 05","NT",251,null,"ES",51,81.600000000000009]
["0229","Thomas Carroll","02290010",null,"K - 05","SW",550,null,"ES",297,475.20000000000005]
["0229","Center","02290015",null,"K - 05","SW",403,null,"ES",168,268.8]
["0229","John E. McCarthy","02290016",null,"PK - 05","SW",323,null,"ES",120,136]
["0229","William A Welch Sr","02290027",null,"PK - 05","SW",336,null,"ES",209,326.40000000000003]
["0229","South Memorial","02290035",null,"PK - 05","NT",391,null,"ES",107,147.20000000000002]
["0229","West Memorial","02290045",null,"PK - 05","NT",232,null,"ES",36,57.6]
["0229","J Henry Higgins Middle","02290305",null,"06 - 08","NT",1430,null,"MS",550,880]
["0229","Peabody Veterans Memorial High","02290510",null,"09 - 12","SW",1492,null,"HS",542,854.40000000000009]
["0230","Pelham Elementary","02300005",null,"K - 06","NT",110,null,"ES",14,22.400000000000002]
["0231","Bryantville Elementary","02310003",null,"K - 06","TA",448,null,"ES",94,150.4]
["0231","Hobomock Elementary","02310010",null,"K - 06","NT",391,null,"ES",51,81.600000000000009]
["0231","North Pembroke Elementary","02310015",null,"PK - 06","TA",528,null,"ES",80,108.80000000000001]
["0231","Pembroke Community Middle School","02310305",null,"07 - 08","TA",432,null,"MS",67,107.2]
["0231","Pembroke High School","02310505",null,"09 - 12","NT",808,null,"HS",103,163.20000000000002]
["0234","Petersham Center","02340005",null,"K - 06","TA",120,null,"ES",38,60.800000000000004]
["0236","Allendale","02360010",null,"K - 05","NT",266,null,"ES",158,252.8]
["0236","Crosby Educational Academy","02360030",null,"01 - 05","NT",22,null,"ES",18,28.8]
["0236","Egremont","02360035",null,"K - 05","NT",409,null,"ES",208,332.8]
["0236","Robert T. Capeless Elementary School","02360045",null,"PK - 05","NT",168,null,"ES",85,123.2]
["0236","Morningside Community School","02360055",null,"PK - 05","SW",349,null,"ES",286,444.8]
["0236","Crosby","02360065",null,"PK - 05","SW",304,null,"ES",236,353.6]
["0236","Stearns","02360090",null,"K - 05","NT",204,null,"ES",100,160]
["0236","Williams","02360100",null,"K - 05","NT",247,null,"ES",74,118.4]
["0236","Silvio O Conte Community","02360105",null,"PK - 05","SW",301,null,"ES",264,408]
["0236","John T Reid Middle","02360305",null,"06 - 08","SW",522,null,"MS",349,558.4]
["0236","Theodore Herberg Middle","02360310",null,"06 - 08","SW",551,null,"MS",316,505.6]
["0236","Pittsfield High","02360505",null,"09 - 12","NT",720,null,"HS",343,534.4]
["0236","Taconic High","02360510",null,"09 - 12","NT",853,null,"HS",451,721.6]
["0236","Eagle Education Academy","02360525",null,"06 - 12","NT",31,null,"MSHS/K-12",29,46.400000000000006]
["0238","Beatrice H Wood Elementary","02380005",null,"04 - 06","NT",260,null,"ES",49,78.400000000000006]
["0238","Anna Ware Jackson","02380010",null,"PK - 03","TA",365,null,"ES",91,123.2]
["0239","Plymouth Early Childhood Center","02390003",null,"PK","NT",178,null,"EES",56,0]
["0239","Cold Spring","02390005",null,"K - 05","SW",193,null,"ES",82,131.20000000000002]
["0239","Hedge","02390010",null,"K - 05","SW",183,null,"ES",115,184]
["0239","Federal Furnace School","02390011",null,"K - 05","SW",348,null,"ES",127,203.20000000000002]
["0239","Indian Brook","02390012",null,"K - 05","NT",539,null,"ES",121,193.60000000000002]
["0239","Manomet Elementary","02390015",null,"K - 05","NT",247,null,"ES",79,126.4]
["0239","Nathaniel Morton Elementary","02390030",null,"K - 05","NT",484,null,"ES",128,204.8]
["0239","South Elementary","02390046",null,"K - 05","NT",605,null,"ES",143,228.8]
["0239","West Elementary","02390047",null,"K - 05","NT",316,null,"ES",91,145.6]
["0239","Plymouth South Middle","02390305",null,"06 - 08","NT",657,null,"MS",143,228.8]
["0239","Plymouth Commun Intermediate","02390405",null,"06 - 08","NT",1005,null,"MS",328,524.80000000000007]
["0239","Plymouth North High","02390505",null,"09 - 12","NT",1246,null,"HS",322,515.20000000000005]
["0239","Plymouth South High","02390515",null,"09 - 12","NT",1070,null,"HS",211,337.6]
["0240","Dennett Elementary","02400010",null,"K - 06","TA",213,null,"ES",31,49.6]
["0242","Provincetown Schools","02420020",null,"PK - 08","SW",139,null,"ESMS",62,83.2]
["0243","Amelio Della Chiesa Early Childhood Center","02430005",null,"PK","NT",166,null,"EES",58,0]
["0243","Beechwood Knoll Elementary","02430020",null,"K - 05","NT",350,null,"ES",157,251.20000000000002]
["0243","Charles A Bernazzani Elementary","02430025",null,"K - 05","NT",321,null,"ES",93,148.80000000000001]
["0243","Lincoln-Hancock Community School","02430035",null,"K - 04","SW",537,null,"ES",259,414.40000000000003]
["0243","Atherton Hough","02430040",null,"K - 05","NT",269,null,"ES",86,137.6]
["0243","Clifford H Marshall Elementary","02430055",null,"K - 04","SW",516,null,"ES",213,340.8]
["0243","Merrymount","02430060",null,"K - 05","NT",326,null,"ES",77,123.2]
["0243","Montclair","02430065",null,"K - 05","NT",442,null,"ES",154,246.4]
["0243","Francis W Parker","02430075",null,"K - 05","SW",312,null,"ES",149,238.4]
["0243","Snug Harbor Community School","02430090",null,"PK - 05","SW",408,null,"ES",272,369.6]
["0243","Squantum","02430095",null,"K - 05","NT",343,null,"ES",93,148.80000000000001]
["0243","Wollaston School","02430110",null,"K - 05","NT",331,null,"ES",103,164.8]
["0243","Atlantic Middle","02430305",null,"06 - 08","NT",544,null,"MS",207,331.20000000000005]
["0243","Broad Meadows Middle","02430310",null,"06 - 08","NT",337,null,"MS",161,257.60000000000002]
["0243","Central Middle","02430315",null,"06 - 08","NT",621,null,"MS",182,291.2]
["0243","South West Middle School","02430320",null,"05 - 08","NT",395,null,"MS",210,336]
["0243","Point Webster Middle","02430325",null,"PK,05 - 08","NT",417,null,"MS",201,292.8]
["0243","Quincy High","02430505",null,"09 - 12","NT",1486,null,"HS",644,1030.4000000000001]
["0243","North Quincy High","02430510",null,"09 - 12","NT",1367,null,"HS",486,761.6]
["0244","Margaret L Donovan","02440015",null,"K - 05","NT",424,null,"ES",216,345.6]
["0244","J F Kennedy Elementary","02440018",null,"PK - 05","SW",392,null,"ES",255,321.60000000000002]
["0244","Elizabeth G Lyons Elementary","02440020",null,"K - 05","SW",295,null,"ES",173,276.8]
["0244","Martin E Young Elementary","02440040",null,"K - 05","SW",251,null,"ES",149,238.4]
["0244","Randolph Community Middle","02440410",null,"06 - 08","NT",670,null,"MS",333,532.80000000000007]
["0244","Randolph High","02440505",null,"09 - 12","NT",638,null,"HS",335,524.80000000000007]
["0246","RISE PreSchool","02460001",null,"PK","NT",107,null,"EES",9,0]
["0246","Alice M Barrows","02460002",null,"K - 05","NT",356,null,"ES",27,43.2]
["0246","Birch Meadow","02460005",null,"K - 05","NT",345,null,"ES",24,38.400000000000006]
["0246","Joshua Eaton","02460010",null,"K - 05","NT",391,null,"ES",40,64]
["0246","J Warren Killam","02460017",null,"K - 05","NT",398,null,"ES",37,59.2]
["0246","Wood End Elementary School","02460020",null,"K - 05","NT",248,null,"ES",22,35.200000000000003]
["0246","Arthur W Coolidge Middle","02460305",null,"06 - 08","NT",398,null,"MS",30,48]
["0246","Walter S Parker Middle","02460310",null,"06 - 08","TA",494,null,"MS",53,84.800000000000011]
["0246","Reading Memorial High","02460505",null,"09 - 12","NT",1225,null,"HS",115,184]
["0248","A. C. Whelan Elementary School","02480003",null,"K - 05","SW",745,null,"ES",417,667.2]
["0248","Beachmont Veterans Memorial School","02480013",null,"PK - 05","SW",328,null,"ES",183,273.60000000000002]
["0248","Rumney Marsh Academy","02480014",null,"06 - 08","SW",600,null,"MS",334,534.4]
["0248","Abraham Lincoln","02480025",null,"PK - 05","SW",546,null,"ES",319,481.6]
["0248","Staff Sargent James J. Hill Elementary School","02480035",null,"K - 05","SW",668,null,"ES",397,635.20000000000005]
["0248","Paul Revere","02480050",null,"K - 05","SW",452,null,"ES",256,409.6]
["0248","Garfield Elementary School","02480056",null,"PK - 05","SW",665,null,"ES",440,668.80000000000007]
["0248","Garfield Middle School","02480057",null,"06 - 08","SW",569,null,"MS",320,512]
["0248","Susan B. Anthony Middle School","02480305",null,"06 - 08","SW",571,null,"MS",349,558.4]
["0248","Revere High","02480505",null,"09 - 12","SW",1961,null,"HS",1071,1700.8000000000002]
["0248","Seacoast School","02480520",null,"09 - 12","SW",68,null,"HS",48,76.800000000000011]
["0249","Richmond Consolidated","02490005",null,"PK - 08","NT",152,null,"ESMS",43,60.800000000000004]
["0250","Rochester Memorial","02500005",null,"PK - 06","TA",487,null,"ES",92,134.4]
["0251","Memorial Park","02510020",null,"K - 04","SW",260,null,"ES",115,184]
["0251","R Stewart Esten","02510025",null,"K - 04","SW",314,null,"ES",143,228.8]
["0251","Jefferson Elementary School","02510060",null,"K - 04","SW",231,null,"ES",93,148.80000000000001]
["0251","John W Rogers Middle","02510305",null,"05 - 08","NT",757,null,"MS",308,492.8]
["0251","Rockland Senior High","02510505",null,"PK,09 - 12","NT",602,null,"HS",234,348.8]
["0252","Rockport Elementary","02520005",null,"PK - 05","TA",299,null,"ES",59,91.2]
["0252","Rockport Middle","02520305",null,"06 - 08","NT",200,null,"MS",54,86.4]
["0252","Rockport High","02520510",null,"09 - 12","NT",258,null,"HS",45,72]
["0253","Rowe Elementary","02530005",null,"K - 06","TA",63,null,"ES",23,36.800000000000004]
["0258","Salem Early Childhood","02580001",null,"PK - K","NT",71,null,"EES",41,8]
["0258","Bates","02580003",null,"K - 05","SW",356,null,"ES",176,281.60000000000002]
["0258","Bentley Academy Innovation School","02580010",null,"K - 05","SW",322,null,"ES",243,388.8]
["0258","Carlton","02580015",null,"K - 05","SW",255,null,"ES",115,184]
["0258","Horace Mann Laboratory","02580030",null,"K - 05","SW",269,null,"ES",166,265.60000000000002]
["0258","Saltonstall School","02580050",null,"K - 08","SW",394,null,"ESMS",180,288]
["0258","Witchcraft Heights","02580070",null,"K - 05","SW",495,null,"ES",259,414.40000000000003]
["0258","Collins Middle","02580305",null,"06 - 08","SW",652,null,"MS",369,590.4]
["0258","Salem High","02580505",null,"09 - 12","NT",841,null,"HS",476,753.6]
["0258","New Liberty Innovation School","02580510",null,"09 - 12","NT",51,null,"HS",36,57.6]
["0258","Salem Prep High School","02580515",null,"09 - 12","NT",17,null,"HS",12,19.200000000000003]
["0261","Forestdale School","02610002",null,"PK - 02","TA",556,null,"EES",125,164.8]
["0261","Oak Ridge","02610025",null,"03 - 06","TA",717,null,"ES",148,236.8]
["0261","Sandwich STEM Academy","02610305",null,"07 - 08","NT",433,null,"MS",84,134.4]
["0261","Sandwich High","02610505",null,"09 - 12","NT",627,null,"HS",93,142.4]
["0262","Lynnhurst","02620040",null,"K - 05","SW",249,null,"ES",89,142.4]
["0262","Oaklandvale","02620050",null,"K - 05","SW",221,null,"ES",116,185.60000000000002]
["0262","Veterans Memorial","02620065",null,"PK - 05","SW",461,null,"ES",176,262.40000000000003]
["0262","Douglas Waybright","02620067",null,"K - 05","SW",179,null,"ES",73,116.80000000000001]
["0262","Saugus Middle School","02620305",null,"06 - 08","SW",620,null,"MS",257,411.20000000000005]
["0262","Saugus High","02620505",null,"09 - 12","SW",676,null,"HS",213,336]
["0263","Emma L Miller Elementary School","02630010",null,"PK - 06","TA",45,null,"ES",20,30.400000000000002]
["0264","Cushing Elementary","02640007",null,"K - 05","NT",318,null,"ES",20,32]
["0264","Hatherly Elementary","02640010",null,"K - 05","NT",254,null,"ES",16,25.6]
["0264","Jenkins Elementary School","02640015",null,"K - 05","NT",319,null,"ES",41,65.600000000000009]
["0264","Wampatuck Elementary","02640020",null,"PK - 05","NT",399,null,"ES",48,64]
["0264","Gates Middle School","02640305",null,"06 - 08","TA",631,null,"MS",82,131.20000000000002]
["0264","Scituate High School","02640505",null,"09 - 12","NT",919,null,"HS",107,168]
["0265","George R Martin","02650007",null,"PK - 05","TA",524,null,"ES",101,148.80000000000001]
["0265","Mildred Aitken School","02650015",null,"PK - 05","NT",460,null,"ES",51,73.600000000000009]
["0265","Dr. Kevin M. Hurley Middle School","02650405",null,"06 - 08","TA",478,null,"MS",85,136]
["0265","Seekonk High","02650505",null,"09 - 12","NT",585,null,"HS",86,137.6]
["0266","Sharon Early Childhood Center","02660001",null,"PK","NT",39,null,"EES",4,0]
["0266","Cottage Street","02660005",null,"K - 05","NT",419,null,"ES",33,52.800000000000004]
["0266","East Elementary","02660010",null,"K - 05","NT",487,null,"ES",48,76.800000000000011]
["0266","Heights Elementary","02660015",null,"K - 05","NT",548,null,"ES",39,62.400000000000006]
["0266","Sharon Middle","02660305",null,"06 - 08","TA",870,null,"MS",78,124.80000000000001]
["0266","Sharon High","02660505",null,"09 - 12","NT",1129,null,"HS",134,214.4]
["0269","Pine Hill","02690010",null,"PK - 05","TA",392,null,"ES",25,36.800000000000004]
["0271","Beal School","02710005",null,"K - 01","TA",254,null,"EES",36,57.6]
["0271","Calvin Coolidge","02710015",null,"K - 04","TA",434,null,"ES",120,192]
["0271","Floral Street School","02710020",null,"01 - 04","NT",680,null,"ES",87,139.20000000000002]
["0271","Walter J Paton","02710025",null,"K - 04","NT",351,null,"ES",33,52.800000000000004]
["0271","Oak Middle School","02710030",null,"07 - 08","NT",988,null,"MS",145,232]
["0271","Spring Street","02710035",null,"K - 04","NT",331,null,"ES",25,40]
["0271","Parker Road Preschool","02710040",null,"PK","NT",144,null,"EES",30,0]
["0271","Sherwood Middle School","02710305",null,"05 - 06","NT",965,null,"ES",130,208]
["0271","Shrewsbury Sr High","02710505",null,"09 - 12","NT",1874,null,"HS",261,417.6]
["0272","Shutesbury Elementary","02720005",null,"PK - 06","TA",112,null,"ES",41,59.2]
["0273","Chace Street","02730005",null,"K - 05","TA",288,null,"ES",65,104]
["0273","North Elementary","02730008",null,"PK - 05","TA",487,null,"ES",124,177.60000000000002]
["0273","South","02730015",null,"K - 05","TA",213,null,"ES",73,116.80000000000001]
["0273","Somerset Middle School","02730305",null,"06 - 08","NT",617,null,"MS",178,284.8]
["0274","Capuano Early Childhood Center","02740005",null,"PK - K","SW",208,null,"EES",81,43.2]
["0274","Benjamin G Brown","02740015",null,"K - 05","NT",212,null,"ES",25,40]
["0274","Arthur D Healey","02740075",null,"PK - 08","SW",452,null,"ESMS",290,448]
["0274","John F Kennedy","02740083",null,"PK - 08","SW",449,null,"ESMS",124,193.60000000000002]
["0274","Albert F. Argenziano School at Lincoln Park","02740087",null,"PK - 08","SW",550,null,"ESMS",210,332.8]
["0274","E Somerville Community","02740111",null,"K - 08","SW",712,null,"ESMS",389,622.40000000000009]
["0274","West Somerville Neighborhood","02740115",null,"PK - 08","SW",375,null,"ESMS",136,216]
["0274","Winter Hill Community","02740120",null,"PK - 08","SW",389,null,"ESMS",219,344]
["0274","Next Wave Junior High","02740410",null,"06 - 08","SW",19,null,"MS",15,24]
["0274","Somerville High","02740505",null,"09 - 12","NT",1205,null,"HS",577,918.40000000000009]
["0274","Full Circle High School","02740510",null,"09 - 12","SW",55,null,"HS",46,70.400000000000006]
["0275","William E Norris","02750005",null,"PK - 06","TA",451,null,"ES",78,118.4]
["0276","Mary E Finn School","02760008",null,"PK - 01","NT",351,null,"EES",28,16]
["0276","Margaret A Neary","02760020",null,"04 - 05","NT",243,null,"ES",12,19.200000000000003]
["0276","Albert S. Woodward Memorial School","02760050",null,"02 - 03","NT",254,null,"ES",18,28.8]
["0276","P Brent Trottier","02760305",null,"06 - 08","NT",390,null,"MS",39,62.400000000000006]
["0277","Charlton Street","02770005",null,"K - 05","SW",281,null,"ES",221,353.6]
["0277","Eastford Road","02770010",null,"PK - 01","SW",361,null,"EES",286,390.40000000000003]
["0277","West Street","02770020",null,"02 - 05","SW",302,null,"ES",243,388.8]
["0277","Southbridge Middle School","02770315",null,"06 - 08","SW",420,null,"MS",313,500.8]
["0277","Southbridge High School","02770515",null,"09 - 12","SW",443,null,"HS",331,529.6]
["0277","Southbridge Academy","02770525",null,"06 - 12","SW",45,null,"MSHS/K-12",41,65.600000000000009]
["0278","Plains Elementary","02780015",null,"PK - 01","TA",262,null,"EES",89,107.2]
["0278","Mosier","02780020",null,"02 - 04","TA",415,null,"ES",132,211.20000000000002]
["0278","Michael E. Smith Middle School","02780305",null,"05 - 08","NT",524,null,"MS",163,260.8]
["0278","South Hadley High","02780505",null,"09 - 12","NT",564,null,"HS",147,228.8]
["0281","Early Childhood Education Center","02810001",null,"PK - K","NT",140,null,"EES",121,20.8]
["0281","Springfield Public Day Elementary School","02810005",null,"01 - 05","SW",38,null,"ES",37,59.2]
["0281","Edward P. Boland School","02810010",null,"PK - 05","SW",608,null,"ES",532,625.6]
["0281","Thomas M Balliet","02810015",null,"PK - 05","SW",300,null,"ES",222,294.40000000000003]
["0281","Samuel Bowles","02810020",null,"K - 05","SW",247,null,"ES",195,312]
["0281","Milton Bradley School","02810023",null,"PK - 05","SW",540,null,"ES",506,712]
["0281","Brightwood","02810025",null,"PK - 05","SW",337,null,"ES",315,456]
["0281","Elias Brookings","02810030",null,"PK - 05","SW",295,null,"ES",259,368]
["0281","Daniel B Brunton","02810035",null,"PK - 05","SW",425,null,"ES",362,544]
["0281","William N. DeBerry","02810045",null,"K - 05","SW",275,null,"ES",255,408]
["0281","Hiram L Dorman","02810050",null,"K - 05","SW",244,null,"ES",212,339.20000000000005]
["0281","Rebecca M Johnson","02810055",null,"PK - 05","SW",700,null,"ES",630,907.2]
["0281","Margaret C Ells","02810060",null,"PK","NT",133,null,"EES",104,0]
["0281","Glenwood","02810065",null,"K - 05","SW",277,null,"ES",234,374.40000000000003]
["0281","Glickman Elementary","02810068",null,"K - 05","SW",299,null,"ES",242,387.20000000000005]
["0281","Frank H Freedman","02810075",null,"K - 05","SW",279,null,"ES",218,348.8]
["0281","Frederick Harris","02810080",null,"PK - 05","SW",603,null,"ES",448,657.6]
["0281","Homer Street","02810085",null,"K - 05","SW",377,null,"ES",339,542.4]
["0281","Alfred G. Zanetti Montessori Magnet School","02810095",null,"PK - 08","SW",405,null,"ESMS",160,222.4]
["0281","Indian Orchard Elementary","02810100",null,"PK - 05","SW",568,null,"ES",492,692.80000000000007]
["0281","Kensington International School","02810110",null,"PK - 05","SW",273,null,"ES",252,348.8]
["0281","Liberty","02810115",null,"K - 05","SW",288,null,"ES",234,374.40000000000003]
["0281","Lincoln","02810120",null,"K - 05","SW",421,null,"ES",389,622.40000000000009]
["0281","Mary A. Dryden Veterans Memorial School","02810125",null,"PK - 05","SW",310,null,"ES",223,316.8]
["0281","Mary M Lynch","02810140",null,"K - 05","SW",233,null,"ES",195,312]
["0281","Mary O Pottenger","02810145",null,"PK - 05","SW",414,null,"ES",327,492.8]
["0281","Mary M Walsh","02810155",null,"PK - 05","SW",293,null,"ES",256,396.8]
["0281","Sumner Avenue","02810160",null,"PK - 05","SW",505,null,"ES",450,616]
["0281","Arthur T Talmadge","02810165",null,"K - 05","SW",236,null,"ES",209,334.40000000000003]
["0281","Alice B Beal Elementary","02810175",null,"K - 05","SW",273,null,"ES",216,345.6]
["0281","Warner","02810180",null,"PK - 05","SW",239,null,"ES",181,246.4]
["0281","Washington","02810185",null,"PK - 05","SW",412,null,"ES",358,502.40000000000003]
["0281","White Street","02810190",null,"K - 05","SW",424,null,"ES",380,608]
["0281","German Gerena Community School","02810195",null,"PK - 05","SW",645,null,"ES",560,806.40000000000009]
["0281","The Springfield Renaissance School an Expeditionary Learning School","02810205",null,"06 - 12","SW",625,null,"MSHS/K-12",405,640]
["0281","Springfield International Academy at Johnson","02810215",null,"03 - 05","SW",15,null,"ES",12,19.200000000000003]
["0281","Kiley Prep","02810315",null,"06","SW",102,null,"MS",85,136]
["0281","Kiley Academy","02810316",null,"06","SW",109,null,"MS",97,155.20000000000002]
["0281","Lyceum Academy","02810317",null,"06 - 08","SW",362,null,"MS",340,544]
["0281","Emergence Academy","02810318",null,"06 - 08","SW",16,null,"MS",14,22.400000000000002]
["0281","John J Duggan Middle","02810320",null,"06 - 12","SW",754,null,"MSHS/K-12",571,913.6]
["0281","Forest Park Middle","02810325",null,"06 - 08","SW",635,null,"MS",556,889.6]
["0281","John F Kennedy Middle","02810328",null,"06 - 08","SW",469,null,"MS",422,675.2]
["0281","M Marcus Kiley Middle","02810330",null,"07 - 08","SW",491,null,"MS",415,664]
["0281","Springfield Public Day Middle School","02810345",null,"06 - 08","SW",53,null,"MS",53,84.800000000000011]
["0281","STEM Middle Academy","02810350",null,"06 - 08","SW",283,null,"MS",227,363.20000000000005]
["0281","South End Middle School","02810355",null,"06 - 08","SW",248,null,"MS",233,372.8]
["0281","Balliet Middle School","02810360",null,"06 - 08","SW",21,null,"MS",21,33.6]
["0281","Chestnut Academy","02810365",null,"08","SW",91,null,"MS",87,139.20000000000002]
["0281","Impact Prep at Chestnut","02810366",null,"06 - 08","SW",231,null,"MS",214,342.40000000000003]
["0281","Chestnut Accelerated Middle School (Talented and Gifted)","02810367",null,"06 - 08","SW",319,null,"MS",240,384]
["0281","Conservatory of the Arts","02810475",null,"06 - 12","SW",328,null,"MSHS/K-12",281,449.6]
["0281","Rise Academy at Van Sickle","02810480",null,"06 - 08","SW",296,null,"MS",252,403.20000000000005]
["0281","Van Sickle Academy","02810485",null,"06 - 08","SW",274,null,"MS",222,355.20000000000005]
["0281","Springfield Central High","02810500",null,"09 - 12","SW",2039,null,"HS",1497,2395.2000000000003]
["0281","High School Of Commerce","02810510",null,"09 - 12","SW",1239,null,"HS",1053,1684.8000000000002]
["0281","Springfield High School of Science and Technology","02810530",null,"09 - 12","SW",1167,null,"HS",979,1555.2]
["0281","Springfield Public Day High School","02810550",null,"09 - 12","SW",84,null,"HS",81,129.6]
["0281","Liberty Preparatory Academy","02810560",null,"09 -10, 12","SW",5,null,"HS",2,3.2]
["0281","Springfield High School","02810570",null,"09 - 12","SW",247,null,"HS",224,358.40000000000003]
["0281","Gateway to College at Holyoke Community College","02810575",null,"09 - 12","SW",37,null,"HS",35,56]
["0281","Gateway to College at Springfield Technical Community College","02810580",null,"09 - 12","SW",28,null,"HS",20,32]
["0281","Roger L. Putnam Vocational Technical Academy","02810620",null,"09 - 12","SW",1382,null,"HS",1038,1660.8000000000002]
["0281","Springfield Vocational Academy","02810675",null,null,"SW",104,null,"SP",72]
["0281","Springfield International Academy at Sci-Tech","02810700",null,"09 - 11","NT",57,null,"HS",40,64]
["0284","Colonial Park","02840005",null,"PK - 04","NT",254,null,"ES",45,60.800000000000004]
["0284","Robin Hood","02840025",null,"PK - 04","TA",364,null,"ES",71,105.60000000000001]
["0284","South","02840030",null,"PK - 04","TA",328,null,"ES",73,108.80000000000001]
["0284","Stoneham Central Middle School","02840405",null,"05 - 08","TA",700,null,"MS",146,233.60000000000002]
["0284","Stoneham High","02840505",null,"09 - 12","NT",611,null,"HS",110,176]
["0285","Helen Hansen Elementary","02850010",null,"K - 05","NT",245,null,"ES",102,163.20000000000002]
["0285","Edwin A Jones Early Childhood Center","02850012",null,"PK","NT",71,null,"EES",28,0]
["0285","Joseph R Dawe Jr Elementary","02850014",null,"K - 05","NT",359,null,"ES",137,219.20000000000002]
["0285","South Elementary","02850015",null,"K - 05","NT",239,null,"ES",63,100.80000000000001]
["0285","Richard L. Wilkins Elementary School","02850020",null,"PK - 05","SW",283,null,"ES",175,264]
["0285","Joseph H Gibbons","02850025",null,"K - 05","NT",346,null,"ES",127,203.20000000000002]
["0285","O'Donnell Middle School","02850405",null,"06 - 08","NT",818,null,"MS",322,515.20000000000005]
["0285","Stoughton High","02850505",null,"09 - 12","NT",1028,null,"HS",355,560]
["0287","Burgess Elementary","02870005",null,"PK - 06","TA",800,null,"ES",147,225.60000000000002]
["0288","Josiah Haynes","02880010",null,"K - 05","NT",338,null,"ES",17,27.200000000000003]
["0288","Israel Loring School","02880015",null,"K - 05","TA",425,null,"ES",58,92.800000000000011]
["0288","General John Nixon Elementary","02880025",null,"K - 05","NT",303,null,"ES",17,27.200000000000003]
["0288","Peter Noyes","02880030",null,"PK - 05","NT",563,null,"ES",32,41.6]
["0288","Ephraim Curtis Middle","02880305",null,"06 - 08","TA",911,null,"MS",44,70.400000000000006]
["0289","Sunderland Elementary","02890005",null,"PK - 06","TA",183,null,"ES",74,102.4]
["0290","Sutton Early Learning","02900003",null,"PK - 02","TA",298,null,"EES",58,81.600000000000009]
["0290","Sutton Elementary","02900005",null,"03 - 05","NT",274,null,"ES",32,51.2]
["0290","Sutton Middle School","02900305",null,"06 - 08","NT",322,null,"MS",43,68.8]
["0290","Sutton High School","02900510",null,"09 - 12","NT",363,null,"HS",55,88]
["0291","Clarke","02910005",null,"K - 04","SW",200,null,"ES",63,100.80000000000001]
["0291","Hadley","02910010",null,"K - 04","SW",301,null,"ES",64,102.4]
["0291","Stanley","02910020",null,"K - 04","NT",220,null,"ES",18,28.8]
["0291","Swampscott Middle","02910305",null,"PK,05 - 08","NT",700,null,"MS",130,188.8]
["0291","Swampscott High","02910505",null,"09 - 12","TA",683,null,"HS",116,185.60000000000002]
["0292","Elizabeth S Brown","02920006",null,"03 - 05","TA",274,null,"ES",75,120]
["0292","Gardner","02920015",null,"K - 02","TA",255,null,"EES",67,107.2]
["0292","Mark G Hoyle Elementary","02920017",null,"PK - 02","TA",203,null,"EES",48,60.800000000000004]
["0292","Joseph G Luther","02920020",null,"03 - 05","TA",195,null,"ES",45,72]
["0292","Joseph Case Jr High","02920305",null,"06 - 08","NT",532,null,"MS",119,190.4]
["0292","Joseph Case High","02920505",null,"09 - 12","NT",551,null,"HS",116,184]
["0293","Edward F. Leddy Preschool","02930005",null,"PK","NT",168,null,"EES",89,0]
["0293","Edmund Hatch Bennett","02930007",null,"K - 04","SW",293,null,"ES",121,193.60000000000002]
["0293","Joseph C Chamberlain","02930008",null,"K - 04","SW",455,null,"ES",205,328]
["0293","East Taunton Elementary","02930010",null,"K - 04","SW",538,null,"ES",241,385.6]
["0293","Mulcahey Elementary School","02930015",null,"PK - 04","SW",773,null,"ES",490,756.80000000000007]
["0293","Elizabeth Pole","02930027",null,"K - 04","SW",556,null,"ES",344,550.4]
["0293","Joseph H Martin","02930042",null,"05 - 07","NT",661,null,"MS",304,486.40000000000003]
["0293","H H Galligan","02930057",null,"K - 04","SW",250,null,"ES",186,297.60000000000002]
["0293","John F Parker Middle","02930305",null,"05 - 07","NT",478,null,"MS",288,460.8]
["0293","Benjamin Friedman Middle","02930315",null,"05 - 07","NT",770,null,"MS",372,595.20000000000005]
["0293","Taunton High","02930505",null,"08 - 12","NT",2680,null,"MSHS/K-12",1269,2022.4]
["0293","Taunton Alternative High School","02930525",null,"10 - 12","NT",119,null,"HS",90,144]
["0295","L F Dewing","02950001",null,"PK - 02","TA",556,null,"EES",102,123.2]
["0295","Heath-Brook","02950010",null,"K - 02","TA",309,null,"EES",58,92.800000000000011]
["0295","North Street","02950020",null,"03 - 04","TA",264,null,"ES",47,75.2]
["0295","John F. Ryan","02950023",null,"05 - 06","NT",479,null,"ES",95,152]
["0295","Louise Davy Trahan","02950025",null,"03 - 04","TA",244,null,"ES",38,60.800000000000004]
["0295","John W. Wynn Middle","02950305",null,"07 - 08","NT",512,null,"MS",88,140.80000000000001]
["0295","Tewksbury Memorial High","02950505",null,"09 - 12","NT",831,null,"HS",153,238.4]
["0296","Tisbury Elementary","02960005",null,"PK - 08","TA",280,null,"ESMS",110,164.8]
["0298","Proctor Elementary","02980005",null,"04 - 06","TA",256,null,"ES",11,17.600000000000001]
["0298","Steward Elementary","02980010",null,"PK - 03","TA",329,null,"ES",15,20.8]
["0300","Truro Central","03000005",null,"PK - 05","SW",112,null,"ES",40,54.400000000000006]
["0301","Tyngsborough Elementary","03010020",null,"PK - 05","TA",730,null,"ES",170,257.60000000000002]
["0301","Tyngsborough Middle","03010305",null,"06 - 08","NT",394,null,"MS",61,97.600000000000009]
["0301","Tyngsborough High School","03010505",null,"09 - 12","NT",443,null,"HS",76,121.60000000000001]
["0304","Taft Early Learning Center","03040005",null,"PK - 03","SW",508,null,"ES",142,206.4]
["0304","Whitin Intermediate","03040405",null,"04 - 07","SW",485,null,"ESMS",106,169.60000000000002]
["0304","Uxbridge High","03040505",null,"08 - 12","NT",597,null,"MSHS/K-12",135,209.60000000000002]
["0304","Gateway to College","03040515",null,"10 - 12","NT",39,null,"HS",18,28.8]
["0305","Early Childhood Center at the Doyle School","03050001",null,"PK","NT",76,null,"EES",12,0]
["0305","Dolbeare","03050005",null,"K - 04","NT",438,null,"ES",53,84.800000000000011]
["0305","Woodville School","03050015",null,"K - 04","TA",414,null,"ES",86,137.6]
["0305","Greenwood","03050020",null,"K - 04","NT",217,null,"ES",20,32]
["0305","Walton","03050040",null,"K - 04","NT",221,null,"ES",17,27.200000000000003]
["0305","Galvin Middle School","03050310",null,"05 - 08","TA",1058,null,"MS",156,249.60000000000002]
["0305","Wakefield Memorial High","03050505",null,"09 - 12","TA",892,null,"HS",115,184]
["0306","Wales Elementary","03060005",null,"PK - 06","TA",127,null,"ES",57,78.400000000000006]
["0307","Daniel Feeney Preschool Center","03070002",null,"PK","NT",74,null,"EES",12,0]
["0307","Elm Street School","03070005",null,"K - 05","NT",431,null,"ES",42,67.2]
["0307","Boyden","03070010",null,"K - 05","TA",346,null,"ES",57,91.2]
["0307","Fisher","03070015",null,"K - 05","NT",464,null,"ES",52,83.2]
["0307","Old Post Road","03070018",null,"K - 05","TA",457,null,"ES",59,94.4]
["0307","Bird Middle","03070305",null,"06 - 08","TA",394,null,"MS",62,99.2]
["0307","Eleanor N Johnson Middle","03070310",null,"06 - 08","TA",422,null,"MS",58,92.800000000000011]
["0307","Walpole High","03070505",null,"09 - 12","NT",1069,null,"HS",135,211.20000000000002]
["0308","Waltham Public Schools Dual Language Program","03080001",null,"K - 04","SW",174,null,"ES",79,126.4]
["0308","William F. Stanley Elementary School","03080005",null,"PK - 05","SW",426,null,"ES",177,236.8]
["0308","Douglas MacArthur Elementary School","03080032",null,"K - 05","NT",449,null,"ES",79,126.4]
["0308","Northeast Elementary School","03080040",null,"PK - 05","SW",494,null,"ES",221,329.6]
["0308","Thomas R Plympton Elementary School","03080050",null,"K - 05","SW",369,null,"ES",164,262.40000000000003]
["0308","James Fitzgerald Elementary School","03080060",null,"K - 05","NT",370,null,"ES",116,185.60000000000002]
["0308","Henry Whittemore Elementary School","03080065",null,"K - 05","SW",425,null,"ES",280,448]
["0308","John F Kennedy Middle","03080404",null,"06 - 08","SW",525,null,"MS",179,286.40000000000003]
["0308","John W. McDevitt Middle School","03080415",null,"06 - 08","SW",670,null,"MS",328,524.80000000000007]
["0308","Waltham Sr High","03080505",null,"09 - 12","NT",1604,null,"HS",668,1068.8]
["0309","Stanley M Koziol Elementary School","03090020",null,"PK - 03","SW",347,null,"ES",238,337.6]
["0309","Ware Middle School","03090305",null,"04 - 06","SW",272,null,"ES",163,260.8]
["0309","Ware Junior/Senior High School","03090505",null,"07 - 12","NT",514,null,"MSHS/K-12",257,408]
["0310","John William Decas","03100003",null,"PK - 02","SW",549,null,"EES",357,508.8]
["0310","Minot Forest","03100017",null,"03 - 04","SW",306,null,"ES",188,300.8]
["0310","Wareham Middle","03100305",null,"05 - 07","NT",524,null,"MS",299,478.40000000000003]
["0310","Wareham Cooperative Alternative School","03100315",null,"09 - 12","NT",51,null,"HS",41,65.600000000000009]
["0310","Wareham Senior High","03100505",null,"08 - 12","NT",563,null,"MSHS/K-12",290,457.6]
["0314","Cunniff","03140015",null,"K - 05","SW",260,null,"ES",67,107.2]
["0314","Hosmer","03140020",null,"PK - 05","SW",597,null,"ES",155,214.4]
["0314","James Russell Lowell","03140025",null,"K - 05","SW",403,null,"ES",117,187.20000000000002]
["0314","Watertown Middle","03140305",null,"06 - 08","SW",561,null,"MS",204,326.40000000000003]
["0314","Watertown High","03140505",null,"09 - 12","NT",692,null,"HS",259,406.40000000000003]
["0315","Claypit Hill School","03150005",null,"K - 05","TA",513,null,"ES",24,38.400000000000006]
["0315","Happy Hollow School","03150015",null,"K - 05","TA",360,null,"ES",34,54.400000000000006]
["0315","Loker School","03150020",null,"K - 05","NT",359,null,"ES",23,36.800000000000004]
["0315","Wayland Middle School","03150305",null,"06 - 08","NT",645,null,"MS",48,76.800000000000011]
["0315","Wayland High School","03150505",null,"09 - 12","NT",835,null,"HS",61,97.600000000000009]
["0316","Park Avenue Elementary","03160015",null,"PK - 04","SW",718,null,"ES",488,739.2]
["0316","Webster Middle School","03160315",null,"05 - 08","SW",572,null,"MS",364,582.4]
["0316","Bartlett High School","03160505",null,"09 - 12","SW",376,null,"HS",216,339.20000000000005]
["0317","Preschool at Wellesley Schools","03170001",null,"PK","NT",77,null,"EES",9,0]
["0317","Katharine Lee Bates","03170005",null,"K - 05","NT",282,null,"ES",10,16]
["0317","Joseph E Fiske","03170015",null,"K - 05","TA",261,null,"ES",20,32]
["0317","John D Hardy","03170020",null,"K - 05","NT",233,null,"ES",18,28.8]
["0317","Hunnewell","03170025",null,"K - 05","NT",226,null,"ES",13,20.8]
["0317","Schofield","03170045",null,"K - 05","TA",336,null,"ES",25,40]
["0317","Sprague Elementary School","03170048",null,"K - 05","NT",312,null,"ES",25,40]
["0317","Ernest F Upham","03170050",null,"K - 05","NT",162,null,"ES",12,19.200000000000003]
["0317","Wellesley Middle","03170305",null,"06 - 08","NT",1077,null,"MS",79,126.4]
["0317","Wellesley Sr High","03170505",null,"09 - 12","TA",1468,null,"HS",98,153.60000000000002]
["0318","Wellfleet Elementary","03180005",null,"K - 05","TA",98,null,"ES",29,46.400000000000006]
["0321","J Harding Armstrong","03210005",null,"K - 03","NT",372,null,"ES",37,59.2]
["0321","Annie E Fales","03210010",null,"K - 03","NT",317,null,"ES",13,20.8]
["0321","Elsie A Hastings Elementary","03210025",null,"PK - 03","NT",470,null,"ES",94,139.20000000000002]
["0321","Mill Pond School","03210045",null,"04 - 06","TA",874,null,"ES",119,190.4]
["0321","Sarah W Gibbons Middle","03210305",null,"07 - 08","NT",624,null,"MS",83,132.80000000000001]
["0321","Westborough High","03210505",null,"09 - 12","NT",1181,null,"HS",149,232]
["0322","Major Edwards Elementary","03220005",null,"PK - 05","TA",387,null,"ES",105,152]
["0322","West Boylston Junior/Senior High","03220505",null,"06 - 12","NT",498,null,"MSHS/K-12",113,180.8]
["0323","Rose L Macdonald","03230003",null,"01 - 03","TA",286,null,"ES",58,92.800000000000011]
["0323","Spring Street School","03230005",null,"PK - K","TA",161,null,"EES",29,35.200000000000003]
["0323","Howard School","03230305",null,"04 - 06","TA",295,null,"ES",50,80]
["0323","West Bridgewater Junior/Senior","03230505",null,"07 - 12","NT",637,null,"MSHS/K-12",135,216]
["0325","Fort Meadow Early Childhood Center","03250003",null,"PK","NT",122,null,"EES",66,0]
["0325","Franklin Ave","03250015",null,"K - 04","SW",185,null,"ES",130,208]
["0325","Abner Gibbs","03250020",null,"K - 04","SW",196,null,"ES",129,206.4]
["0325","Highland","03250025",null,"K - 04","SW",314,null,"ES",143,228.8]
["0325","Munger Hill","03250033",null,"K - 04","SW",359,null,"ES",138,220.8]
["0325","Paper Mill","03250036",null,"K - 04","SW",320,null,"ES",160,256]
["0325","Southampton Road","03250040",null,"K - 04","SW",278,null,"ES",112,179.20000000000002]
["0325","Westfield Intermediate School","03250075",null,"05 - 06","SW",691,null,"ES",297,475.20000000000005]
["0325","Westfield Middle School","03250310",null,"07 - 08","SW",768,null,"MS",323,516.80000000000007]
["0325","Westfield High","03250505",null,"09 - 12","SW",1100,null,"HS",357,555.20000000000005]
["0325","Westfield Technical Academy","03250605",null,"09 - 12","SW",561,null,"HS",232,369.6]
["0326","Abbot Elementary","03260004",null,"03 - 05","NT",356,null,"ES",25,40]
["0326","Day Elementary","03260007",null,"03 - 05","NT",327,null,"ES",25,40]
["0326","Nabnasset","03260015",null,"PK - 02","NT",336,null,"EES",17,25.6]
["0326","Col John Robinson","03260025",null,"PK - 02","NT",293,null,"EES",25,36.800000000000004]
["0326","John A. Crisafulli Elementary School","03260045",null,"03 - 05","NT",355,null,"ES",25,40]
["0326","Rita E. Miller Elementary School","03260055",null,"PK - 02","TA",297,null,"EES",43,56]
["0326","Blanchard Middle","03260310",null,"06 - 08","NT",538,null,"MS",37,59.2]
["0326","Stony Brook School","03260330",null,"06 - 08","NT",599,null,"MS",41,65.600000000000009]
["0326","Westford Academy","03260505",null,"09 - 12","NT",1641,null,"HS",101,160]
["0327","Westhampton Elementary School","03270005",null,"PK - 06","NT",106,null,"ES",25,35.200000000000003]
["0330","Country","03300010",null,"PK - 03","TA",334,null,"ES",24,36.800000000000004]
["0330","Field Elementary School","03300012",null,"04 - 05","NT",284,null,"ES",20,32]
["0330","Woodland","03300015",null,"PK - 03","TA",197,null,"ES",14,22.400000000000002]
["0330","Weston Middle","03300305",null,"06 - 08","NT",456,null,"MS",32,51.2]
["0330","Weston High","03300505",null,"09 - 12","NT",633,null,"HS",29,46.400000000000006]
["0331","Alice A Macomber","03310015",null,"PK - 02","SW",359,null,"EES",125,171.20000000000002]
["0331","Westport Elementary","03310030",null,"03 - 06","SW",467,null,"ES",132,211.20000000000002]
["0331","Westport Junior/Senior High School","03310515",null,"07 - 12","NT",545,null,"MSHS/K-12",140,220.8]
["0332","Cowing Early Childhood","03320001",null,"PK","NT",88,null,"EES",51,0]
["0332","John Ashley","03320005",null,"K","SW",238,null,"EES",113,180.8]
["0332","Philip G Coburn","03320007",null,"K - 05","SW",482,null,"ES",370,592]
["0332","John R Fausey","03320010",null,"K - 05","SW",414,null,"ES",159,254.4]
["0332","Memorial","03320025",null,"01 - 05","SW",177,null,"ES",138,220.8]
["0332","Mittineague","03320030",null,"01 - 05","SW",164,null,"ES",70,112]
["0332","Tatham","03320040",null,"01 - 05","SW",250,null,"ES",83,132.80000000000001]
["0332","West Springfield Middle","03320305",null,"06 - 08","SW",898,null,"MS",453,724.80000000000007]
["0332","West Springfield High","03320505",null,"09 - 12","NT",1187,null,"HS",541,843.2]
["0335","Deerfield School","03350010",null,"K - 05","NT",187,null,"ES",14,22.400000000000002]
["0335","Downey","03350012",null,"PK - 05","NT",292,null,"ES",17,27.200000000000003]
["0335","Paul Hanlon","03350015",null,"K - 05","NT",194,null,"ES",12,19.200000000000003]
["0335","Martha Jones","03350017",null,"K - 05","NT",271,null,"ES",9,14.4]
["0335","William E Sheehan","03350025",null,"K - 05","NT",292,null,"ES",11,17.600000000000001]
["0335","Westwood Integrated Preschool","03350050",null,"PK","NT",50,null,"EES",4,0]
["0335","E W Thurston Middle","03350305",null,"06 - 08","NT",679,null,"MS",57,91.2]
["0335","Westwood High","03350505",null,"09 - 12","NT",991,null,"HS",61,97.600000000000009]
["0336","Johnson Early Childhood Center","03360003",null,"PK","NT",136,null,"EES",52,0]
["0336","Academy Avenue","03360005",null,"K - 05","TA",343,null,"ES",105,168]
["0336","Frederick C Murphy","03360050",null,"K - 05","TA",270,null,"ES",98,156.80000000000001]
["0336","Thomas V Nash","03360060",null,"K - 05","NT",203,null,"ES",60,96]
["0336","Lawrence W Pingree","03360065",null,"K - 05","TA",219,null,"ES",79,126.4]
["0336","William Seach","03360080",null,"K - 05","SW",377,null,"ES",235,376]
["0336","Ralph Talbot","03360085",null,"K - 05","TA",263,null,"ES",88,140.80000000000001]
["0336","Thomas W. Hamilton Primary School","03360105",null,"K - 05","NT",342,null,"ES",89,142.4]
["0336","Wessagusset","03360110",null,"K - 05","NT",297,null,"ES",94,150.4]
["0336","Abigail Adams Middle School","03360310",null,"06 - 07","SW",873,null,"MS",322,515.20000000000005]
["0336","Weymouth High School","03360505",null,"08 - 12","NT",2225,null,"MSHS/K-12",715,1123.2]
["0337","Whately Elementary","03370005",null,"PK - 06","NT",116,null,"ES",22,32]
["0340","Anne T. Dunphy School","03400020",null,"PK - 06","TA",116,null,"ES",35,54.400000000000006]
["0342","Boutwell","03420005",null,"PK - K","NT",113,null,"EES",11,17.600000000000001]
["0342","Wildwood","03420015",null,"PK - K","NT",106,null,"EES",22,27.200000000000003]
["0342","Woburn Street","03420020",null,"01 - 03","TA",362,null,"ES",41,65.600000000000009]
["0342","Shawsheen Elementary","03420025",null,"01 - 03","TA",314,null,"ES",38,60.800000000000004]
["0342","North Intermediate","03420060",null,"04 - 05","NT",245,null,"ES",32,51.2]
["0342","West Intermediate","03420080",null,"04 - 05","NT",218,null,"ES",30,48]
["0342","Wilmington Middle School","03420330",null,"06 - 08","NT",709,null,"MS",91,145.6]
["0342","Wilmington High","03420505",null,"09 - 12","NT",754,null,"HS",73,116.80000000000001]
["0343","Winchendon PreSchool Program","03430010",null,"PK","NT",56,null,"EES",25,0]
["0343","Memorial","03430040",null,"K - 02","SW",261,null,"EES",147,235.20000000000002]
["0343","Toy Town Elementary","03430050",null,"03 - 05","SW",289,null,"ES",152,243.20000000000002]
["0343","Murdock Middle School","03430315",null,"06 - 08","SW",273,null,"MS",120,192]
["0343","Murdock Academy for Success","03430405",null,"09 - 12","SW",29,null,"HS",17,27.200000000000003]
["0343","Murdock High School","03430515",null,"09 - 12","SW",257,null,"HS",121,193.60000000000002]
["0344","Lincoln Elementary","03440005",null,"K - 05","NT",384,null,"ES",9,14.4]
["0344","Lynch Elementary","03440020",null,"PK - 05","TA",511,null,"ES",45,59.2]
["0344","Vinson-Owen Elementary","03440025",null,"PK - 05","NT",395,null,"ES",16,24]
["0344","Muraco Elementary","03440040",null,"K - 05","NT",367,null,"ES",25,40]
["0344","Ambrose Elementary","03440045",null,"K - 05","NT",326,null,"ES",5,8]
["0344","McCall Middle","03440305",null,"06 - 08","NT",1079,null,"MS",53,84.800000000000011]
["0344","Winchester High School","03440505",null,"09 - 12","NT",1398,null,"HS",93,148.80000000000001]
["0346","William P. Gorman/Fort Banks Elementary","03460015",null,"PK - 02","SW",431,null,"EES",143,220.8]
["0346","Arthur T. Cummings Elementary School","03460020",null,"03 - 05","SW",391,null,"ES",129,206.4]
["0346","Winthrop Middle School","03460305",null,"06 - 08","SW",448,null,"MS",156,249.60000000000002]
["0346","Winthrop High School","03460505",null,"09 - 12","SW",553,null,"HS",162,259.2]
["0347","Goodyear Elementary School","03470005",null,"K - 05","SW",290,null,"ES",109,174.4]
["0347","Hurld-Wyman Elementary School","03470020",null,"K - 05","NT",363,null,"ES",71,113.60000000000001]
["0347","Linscott-Rumford","03470025",null,"K - 05","SW",191,null,"ES",50,80]
["0347","Clyde Reeves","03470040",null,"PK - 05","NT",392,null,"ES",113,137.6]
["0347","Shamrock","03470043",null,"PK - 05","SW",280,null,"ES",123,168]
["0347","Malcolm White","03470055",null,"K - 05","SW",279,null,"ES",122,195.20000000000002]
["0347","Mary D Altavesta","03470065",null,"K - 05","SW",230,null,"ES",86,137.6]
["0347","John F Kennedy Middle School","03470405",null,"06 - 08","NT",511,null,"MS",195,312]
["0347","Daniel L Joyce Middle School","03470410",null,"06 - 08","NT",519,null,"MS",179,286.40000000000003]
["0347","Woburn High","03470505",null,"09 - 12","NT",1213,null,"HS",366,568]
["0348","Head Start","03480002",null,"PK","NT",336,null,"EES",302,0]
["0348","Belmont Street Community","03480020",null,"PK - 06","SW",567,null,"ES",483,728]
["0348","Wawecus Road School","03480026",null,"K - 06","SW",127,null,"ES",85,136]
["0348","Woodland Academy","03480030",null,"K - 06","SW",515,null,"ES",409,654.40000000000009]
["0348","Burncoat Street","03480035",null,"K - 06","SW",261,null,"ES",219,350.40000000000003]
["0348","Canterbury","03480045",null,"PK - 06","SW",303,null,"ES",240,364.8]
["0348","Chandler Elementary Community","03480050",null,"K - 06","SW",450,null,"ES",374,598.4]
["0348","Chandler Magnet","03480052",null,"PK - 06","SW",481,null,"ES",335,526.4]
["0348","City View","03480053",null,"PK - 06","SW",472,null,"ES",410,636.80000000000007]
["0348","Clark St Community","03480055",null,"PK - 06","SW",238,null,"ES",201,297.60000000000002]
["0348","Columbus Park","03480060",null,"PK - 06","SW",388,null,"ES",309,476.8]
["0348","Flagg Street","03480090",null,"K - 06","SW",339,null,"ES",87,139.20000000000002]
["0348","Elm Park Community","03480095",null,"K - 06","SW",405,null,"ES",347,555.20000000000005]
["0348","Goddard School/Science Technical","03480100",null,"PK - 06","SW",366,null,"ES",298,454.40000000000003]
["0348","Gates Lane","03480110",null,"PK - 06","SW",523,null,"ES",345,494.40000000000003]
["0348","Grafton Street","03480115",null,"K - 06","SW",383,null,"ES",302,483.20000000000005]
["0348","Heard Street","03480136",null,"K - 06","SW",246,null,"ES",130,208]
["0348","Jacob Hiatt Magnet","03480140",null,"PK - 06","SW",380,null,"ES",231,329.6]
["0348","Lake View","03480145",null,"K - 06","SW",312,null,"ES",149,238.4]
["0348","Lincoln Street","03480160",null,"K - 06","SW",246,null,"ES",197,315.20000000000005]
["0348","May Street","03480175",null,"K - 06","SW",280,null,"ES",139,222.4]
["0348","Francis J McGrath Elementary","03480177",null,"K - 06","SW",228,null,"ES",147,235.20000000000002]
["0348","Midland Street","03480185",null,"K - 06","SW",203,null,"ES",96,153.60000000000002]
["0348","Nelson Place","03480200",null,"PK - 06","SW",543,null,"ES",218,316.8]
["0348","Norrback Avenue","03480202",null,"PK - 06","SW",526,null,"ES",306,456]
["0348","Quinsigamond","03480210",null,"PK - 06","SW",698,null,"ES",522,822.40000000000009]
["0348","Rice Square","03480215",null,"K - 06","SW",467,null,"ES",306,489.6]
["0348","Roosevelt","03480220",null,"PK - 06","SW",618,null,"ES",323,448]
["0348","Worcester Arts Magnet School","03480225",null,"PK - 06","SW",358,null,"ES",122,185.60000000000002]
["0348","Tatnuck","03480230",null,"PK - 06","SW",394,null,"ES",203,305.60000000000002]
["0348","Thorndyke Road","03480235",null,"K - 06","SW",353,null,"ES",201,321.60000000000002]
["0348","Union Hill School","03480240",null,"K - 06","SW",388,null,"ES",317,507.20000000000005]
["0348","West Tatnuck","03480260",null,"PK - 06","SW",335,null,"ES",116,166.4]
["0348","Vernon Hill School","03480280",null,"PK - 06","SW",476,null,"ES",379,572.80000000000007]
["0348","University Pk Campus School","03480285",null,"07 - 12","SW",229,null,"MSHS/K-12",158,252.8]
["0348","Claremont Academy","03480350",null,"07 - 12","SW",542,null,"MSHS/K-12",415,662.40000000000009]
["0348","Burncoat Middle School","03480405",null,"07 - 08","SW",685,null,"MS",432,691.2]
["0348","Forest Grove Middle","03480415",null,"07 - 08","SW",909,null,"MS",512,819.2]
["0348","Worcester East Middle","03480420",null,"07 - 08","SW",737,null,"MS",550,880]
["0348","Sullivan Middle","03480423",null,"06 - 08","SW",933,null,"MS",631,1009.6]
["0348","Burncoat Senior High","03480503",null,"09 - 12","SW",1166,null,"HS",730,1155.2]
["0348","Doherty Memorial High","03480512",null,"09 - 12","SW",1430,null,"HS",697,1099.2]
["0348","North High","03480515",null,"09 - 12","SW",1307,null,"HS",976,1537.6000000000001]
["0348","South High Community","03480520",null,"09 - 12","SW",1429,null,"HS",967,1524.8000000000002]
["0348","Worcester Technical High","03480605",null,"09 - 12","SW",1470,null,"HS",739,1182.4000000000001]
["0349","R. H. Conwell","03490010",null,"PK - 06","TA",61,null,"ES",22,35.200000000000003]
["0350","Delaney","03500003",null,"PK - 03","TA",506,null,"ES",48,62.400000000000006]
["0350","Charles E Roderick","03500010",null,"04 - 06","NT",376,null,"ES",45,72]
["0406","Smith Vocational and Agricultural High","04060705",null,"09 - 12","SW",529,null,"HS",192,307.20000000000005]
["0407","Dudley Street Neighborhood Charter School","04070405",null,"PK - 05","SW",278,null,"ES",197,256]
["0409","Alma del Mar Charter School","04090205",null,"K - 08","SW",800,null,"ESMS",536,857.6]
["0410","Excel Academy Charter School","04100205",null,"05 - 12","SW",1398,null,"MSHS/K-12",753,1204.8]
["0411","Boston Green Academy Horace Mann Charter School","04110305",null,"06 - 12","SW",496,null,"MSHS/K-12",355,564.80000000000007]
["0412","Academy Of the Pacific Rim Charter Public School","04120530",null,"05 - 12","SW",539,null,"MSHS/K-12",267,427.20000000000005]
["0413","Four Rivers Charter Public School","04130505",null,"07 - 12","TA",216,null,"MSHS/K-12",65,104]
["0414","Berkshire Arts and Technology Charter Public School","04140305",null,"06 - 12","SW",368,null,"MSHS/K-12",186,297.60000000000002]
["0416","Boston Preparatory Charter Public School","04160305",null,"06 - 12","SW",667,null,"MSHS/K-12",402,643.20000000000005]
["0417","Bridge Boston Charter School","04170205",null,"PK - 08","SW",335,null,"ESMS",223,326.40000000000003]
["0418","Christa McAuliffe Charter Public School","04180305",null,"06 - 08","TA",399,null,"MS",158,252.8]
["0419","Helen Y. Davis Leadership Academy Charter Public School","04190305",null,"06 - 08","SW",187,null,"MS",123,196.8]
["0420","Benjamin Banneker Charter Public School","04200205",null,"PK - 06","SW",340,null,"ES",199,308.8]
["0424","Boston Day and Evening Academy Charter School","04240505",null,"09 - 12","SW",399,null,"HS",285,456]
["0426","Gateway (District): Community Day Charter Public School: Gateway","04260205",null,"PK - 08","SW",401,null,"ESMS",265,385.6]
["0428","Brooke Charter School","04280305",null,"K - 12","SW",2065,null,"MSHS/K-12",1145,1832]
["0429","KIPP Academy Lynn Charter School","04290010",null,"K - 12","SW",1611,null,"MSHS/K-12",941,1505.6000000000001]
["0430","Advanced Math and Science Academy Charter School","04300305",null,"06 - 12","TA",964,null,"MSHS/K-12",102,163.20000000000002]
["0431","R. Kingman Webster (District): Community Day Charter Public School: R. Kingman Webster","04310205",null,"PK - 08","SW",400,null,"ESMS",246,356.8]
["0432","Cape Cod Lighthouse Charter School","04320530",null,"06 - 08","TA",252,null,"MS",44,70.400000000000006]
["0435","Innovation Academy Charter School","04350305",null,"05 - 12","TA",783,null,"MSHS/K-12",143,228.8]
["0436","Community Charter School of Cambridge","04360305",null,"06 - 12","SW",306,null,"MSHS/K-12",141,225.60000000000002]
["0437","City on a Hill Charter Public School Circuit Street","04370505",null,"09 - 12","SW",284,null,"HS",198,316.8]
["0438","Codman Academy Charter Public School","04380505",null,"PK - 12","SW",347,null,"MSHS/K-12",241,364.8]
["0439","Conservatory Lab Charter School","04390050",null,"PK - 08","SW",452,null,"ESMS",280,401.6]
["0440","Prospect (District): Community Day Charter Public School: Prospect","04400205",null,"PK - 08","SW",400,null,"ESMS",259,376]
["0441","Sabis International Charter School","04410505",null,"K - 12","SW",1573,null,"MSHS/K-12",752,1203.2]
["0444","Neighborhood House Charter School","04440205",null,"PK - 12","SW",798,null,"MSHS/K-12",416,630.40000000000009]
["0445","Abby Kelley Foster Charter Public School","04450105",null,"K - 12","SW",1425,null,"MSHS/K-12",683,1092.8]
["0446","Foxborough Regional Charter School","04460550",null,"K - 12","TA",1688,null,"MSHS/K-12",524,838.40000000000009]
["0447","Benjamin Franklin Classical Charter Public School","04470205",null,"K - 08","TA",775,null,"ESMS",109,174.4]
["0449","Boston Collegiate Charter School","04490305",null,"05 - 12","SW",719,null,"MSHS/K-12",279,446.40000000000003]
["0450","Hilltown Cooperative Charter Public School","04500105",null,"K - 08","TA",218,null,"ESMS",34,54.400000000000006]
["0452","Edward M. Kennedy Academy for Health Careers (Horace Mann Charter School)","04520505",null,"09 - 12","SW",396,null,"HS",286,457.6]
["0453","Holyoke Community Charter School","04530005",null,"K - 08","SW",701,null,"ESMS",528,844.80000000000007]
["0454","Lawrence Family Development Charter School","04540205",null,"PK - 08","SW",800,null,"ESMS",539,766.40000000000009]
["0455","Hill View Montessori Charter Public School","04550050",null,"K - 08","TA",305,null,"ESMS",99,158.4]
["0456","Lowell Community Charter Public School","04560050",null,"PK - 08","SW",804,null,"ESMS",464,704]
["0458","Lowell Middlesex Academy Charter School","04580505",null,"09 - 12","SW",86,null,"HS",61,97.600000000000009]
["0463","KIPP Academy Boston Charter School","04630205",null,"K - 08","SW",623,null,"ESMS",453,724.80000000000007]
["0464","Marblehead Community Charter Public School","04640305",null,"04 - 08","TA",212,null,"ESMS",39,62.400000000000006]
["0466","Martha's Vineyard Charter School","04660550",null,"K - 12","TA",168,null,"MSHS/K-12",66,105.60000000000001]
["0469","MATCH Charter Public School","04690505",null,"PK - 12","SW",1216,null,"MSHS/K-12",838,1275.2]
["0470","Mystic Valley Regional Charter School","04700105",null,"K - 12","NT",1616,null,"MSHS/K-12",389,622.40000000000009]
["0474","A North Central Charter Essential (District): Sizer School: A North Central Charter Essential School","04740505",null,"07 - 12","SW",368,null,"MSHS/K-12",157,251.20000000000002]
["0478","Francis W. Parker Charter Essential School","04780505",null,"07 - 12","NT",393,null,"MSHS/K-12",38,60.800000000000004]
["0479","Pioneer Valley Performing Arts Charter Public School","04790505",null,"07 - 12","TA",396,null,"MSHS/K-12",125,200]
["0480","UP Academy Charter School of Boston","04800405",null,"06 - 08","SW",352,null,"MS",283,452.8]
["0481","Boston Renaissance Charter Public School","04810550",null,"PK - 06","SW",944,null,"ES",581,814.40000000000009]
["0482","River Valley Charter School","04820050",null,"K - 08","TA",288,null,"ESMS",23,36.800000000000004]
["0483","Rising Tide Charter Public School","04830305",null,"05 - 12","TA",663,null,"MSHS/K-12",117,187.20000000000002]
["0484","Roxbury Preparatory Charter School","04840505",null,"05 - 12","SW",1595,null,"MSHS/K-12",1117,1787.2]
["0485","Salem Academy Charter School","04850485",null,"06 - 12","SW",492,null,"MSHS/K-12",191,305.60000000000002]
["0486","Learning First Charter Public School","04860105",null,"K - 08","SW",670,null,"ESMS",483,772.80000000000007]
["0487","Prospect Hill Academy Charter School","04870550",null,"K - 12","SW",1105,null,"MSHS/K-12",592,947.2]
["0488","South Shore Charter Public School","04880550",null,"K - 12","TA",1006,null,"MSHS/K-12",293,468.8]
["0489","Sturgis Charter Public School","04890505",null,"09 - 12","NT",851,null,"HS",128,204.8]
["0491","Atlantis Charter School","04910550",null,"K - 12","SW",1300,null,"MSHS/K-12",668,1068.8]
["0492","Martin Luther King Jr. Charter School of Excellence","04920005",null,"K - 05","SW",359,null,"ES",279,446.40000000000003]
["0493","Phoenix Charter Academy","04930505",null,"09 - 12","SW",210,null,"HS",119,190.4]
["0494","Pioneer Charter School of Science","04940205",null,"K - 12","SW",792,null,"MSHS/K-12",362,579.20000000000005]
["0496","Global Learning Charter Public School","04960305",null,"05 - 12","SW",501,null,"MSHS/K-12",297,475.20000000000005]
["0497","Pioneer Valley Chinese Immersion Charter School","04970205",null,"K - 12","TA",559,null,"MSHS/K-12",126,201.60000000000002]
["0498","Veritas Preparatory Charter School","04980405",null,"05 - 08","SW",408,null,"MS",317,507.20000000000005]
["0499","Hampden Charter School of Science East","04990305",null,"06 - 12","SW",536,null,"MSHS/K-12",281,449.6]
["0600","Carol Huebner Early Childhood Program","06000001",null,"PK","NT",86,null,"EES",13,0]
["0600","Blanchard Memorial School","06000005",null,"K - 06","NT",488,null,"ES",33,52.800000000000004]
["0600","Merriam School","06000010",null,"K - 06","NT",439,null,"ES",36,57.6]
["0600","McCarthy-Towne School","06000015",null,"K - 06","TA",486,null,"ES",56,89.600000000000009]
["0600","C.T. Douglas Elementary School","06000020",null,"K - 06","TA",378,null,"ES",39,62.400000000000006]
["0600","Paul P Gates Elementary School","06000025",null,"K - 06","NT",368,null,"ES",38,60.800000000000004]
["0600","Luther Conant School","06000030",null,"K - 06","NT",405,null,"ES",36,57.6]
["0600","Raymond J Grey Junior High","06000405",null,"07 - 08","TA",835,null,"MS",75,120]
["0600","Acton-Boxborough Regional High","06000505",null,"09 - 12","NT",1756,null,"HS",138,217.60000000000002]
["0603","Hoosac Valley Elementary School","06030020",null,"PK - 03","SW",325,null,"ES",184,272]
["0603","Hoosac Valley Middle School","06030315",null,"04 - 07","SW",353,null,"ESMS",202,323.20000000000005]
["0603","Hoosac Valley High School","06030505",null,"08 - 12","NT",329,null,"MSHS/K-12",157,249.60000000000002]
["0605","Amherst Regional Middle School","06050405",null,"07 - 08","TA",407,null,"MS",129,206.4]
["0605","Amherst Regional High","06050505",null,"09 - 12","NT",865,null,"HS",240,374.40000000000003]
["0610","Westminster Elementary","06100005",null,"02 - 05","TA",372,null,"ES",75,120]
["0610","Meetinghouse School","06100010",null,"K - 01","TA",163,null,"EES",29,46.400000000000006]
["0610","Briggs Elementary","06100025",null,"PK - 05","TA",479,null,"ES",112,164.8]
["0610","Overlook Middle School","06100305",null,"06 - 08","NT",564,null,"MS",123,196.8]
["0610","Oakmont Regional High School","06100505",null,"09 - 12","NT",639,null,"HS",127,188.8]
["0615","Athol Community Elementary School","06150020",null,"PK - 04","SW",549,null,"ES",343,488]
["0615","Royalston Community School","06150050",null,"K - 06","TA",133,null,"ES",52,83.2]
["0615","Athol-Royalston Middle School","06150305",null,"05 - 08","SW",429,null,"MS",266,425.6]
["0615","Athol High","06150505",null,"09 - 12","SW",346,null,"HS",170,270.40000000000003]
["0616","Lura A. White Elementary School","06160001",null,"K - 05","SW",329,null,"ES",92,147.20000000000002]
["0616","Page Hilltop Elementary School","06160002",null,"PK - 05","SW",510,null,"ES",163,228.8]
["0616","Ayer Shirley Regional Middle School","06160305",null,"06 - 08","SW",412,null,"MS",104,166.4]
["0616","Ayer Shirley Regional High School","06160505",null,"09 - 12","SW",353,null,"HS",84,134.4]
["0618","Muddy Brook Regional Elementary School","06180035",null,"PK - 04","SW",319,null,"ES",139,216]
["0618","W.E.B. Du Bois Regional Middle School","06180310",null,"05 - 08","SW",343,null,"MS",138,220.8]
["0618","Monument Mt Regional High","06180505",null,"09 - 12","NT",500,null,"HS",123,195.20000000000002]
["0620","Berlin Memorial School","06200005",null,"PK - 05","TA",193,null,"ES",37,49.6]
["0620","Boylston Elementary School","06200010",null,"PK - 05","TA",306,null,"ES",33,44.800000000000004]
["0620","Tahanto Regional High","06200505",null,"06 - 12","TA",541,null,"MSHS/K-12",73,116.80000000000001]
["0622","John F Kennedy Elementary","06220008",null,"K - 02","SW",199,null,"EES",68,108.80000000000001]
["0622","Millville Elementary","06220010",null,"PK - 05","SW",284,null,"ES",92,126.4]
["0622","A F Maloney","06220015",null,"03 - 05","SW",270,null,"ES",80,128]
["0622","Frederick W. Hartnett Middle School","06220405",null,"06 - 08","NT",385,null,"MS",98,156.80000000000001]
["0622","Blackstone Millville RHS","06220505",null,"09 - 12","NT",408,null,"HS",106,166.4]
["0625","Mitchell Elementary School","06250002",null,"PK - 03","SW",1118,null,"ES",248,347.20000000000005]
["0625","Merrill Elementary School","06250020",null,"K - 01","SW",303,null,"EES",73,116.80000000000001]
["0625","Laliberte Elementary School","06250050",null,"02 - 04","SW",538,null,"ES",119,190.4]
["0625","Williams Intermediate School","06250300",null,"04 - 06","NT",700,null,"ES",140,224]
["0625","Raynham Middle School","06250315",null,"05 - 08","NT",722,null,"MS",141,225.60000000000002]
["0625","Bridgewater Middle School","06250320",null,"07 - 08","NT",551,null,"MS",126,201.60000000000002]
["0625","Therapeutic Day School","06250415",null,"08 - 12","NT",14,null,"MSHS/K-12",9,14.4]
["0625","Bridgewater-Raynham Regional","06250505",null,"09 - 12","NT",1353,null,"HS",274,427.20000000000005]
["0632","New Hingham Regional Elementary","06320025",null,"PK - 06","NT",111,null,"ES",33,48]
["0635","Becket Washington School","06350005",null,"PK - 05","SW",99,null,"ES",48,68.8]
["0635","Craneville","06350025",null,"K - 05","SW",392,null,"ES",170,272]
["0635","Kittredge","06350035",null,"PK - 05","SW",149,null,"ES",48,56]
["0635","Nessacus Regional Middle School","06350305",null,"06 - 08","SW",355,null,"MS",135,216]
["0635","Wahconah Regional High","06350505",null,"09 - 12","SW",511,null,"HS",152,243.20000000000002]
["0640","Concord Carlisle High","06400505",null,"09 - 12","TA",1311,null,"HS",104,161.60000000000002]
["0645","Ezra H Baker Innovation School","06450005",null,"PK - 03","SW",299,null,"ES",166,225.60000000000002]
["0645","Marguerite E Small Elementary","06450015",null,"PK - 03","SW",292,null,"ES",193,267.2]
["0645","Station Avenue Elementary","06450025",null,"K - 03","SW",395,null,"ES",176,281.60000000000002]
["0645","Nathaniel H. Wixon School","06450050",null,"04 - 06","NT",488,null,"ES",233,372.8]
["0645","Mattacheese Middle School","06450305",null,"06 - 07","NT",422,null,"MS",216,345.6]
["0645","Dennis-Yarmouth Regional High","06450505",null,"07 - 12","NT",870,null,"MSHS/K-12",374,598.4]
["0650","Dighton Elementary","06500005",null,"PK - 04","TA",437,null,"ES",93,145.6]
["0650","Palmer River","06500010",null,"PK - 04","TA",557,null,"ES",90,134.4]
["0650","Dighton Middle School","06500305",null,"05 - 08","NT",380,null,"MS",74,118.4]
["0650","Dorothy L Beckwith","06500310",null,"05 - 08","NT",484,null,"MS",83,132.80000000000001]
["0650","Dighton-Rehoboth Regional High School","06500505",null,"09 - 12","NT",750,null,"HS",134,208]
["0655","Dover-Sherborn Regional Middle School","06550405",null,"06 - 08","TA",508,null,"MS",21,33.6]
["0655","Dover-Sherborn Regional High","06550505",null,"09 - 12","NT",667,null,"HS",25,36.800000000000004]
["0658","Dudley Elementary","06580005",null,"02 - 04","SW",335,null,"ES",104,166.4]
["0658","Mason Road School","06580010",null,"PK - 01","SW",245,null,"EES",89,120]
["0658","Charlton Elementary","06580020",null,"PK - 01","SW",291,null,"EES",87,108.80000000000001]
["0658","Heritage School","06580030",null,"02 - 04","SW",399,null,"ES",94,150.4]
["0658","Dudley Middle School","06580305",null,"05 - 08","SW",535,null,"MS",168,268.8]
["0658","Charlton Middle School","06580310",null,"05 - 08","NT",629,null,"MS",133,212.8]
["0658","Shepherd Hill Regional High","06580505",null,"09 - 12","NT",998,null,"HS",232,366.40000000000003]
["0660","Nauset Regional Middle","06600305",null,"06 - 08","TA",573,null,"MS",165,264]
["0660","Nauset Regional High","06600505",null,"09 - 12","NT",847,null,"HS",195,308.8]
["0662","Farmington River Elementary","06620020",null,"PK - 06","TA",113,null,"ES",46,57.6]
["0665","Freetown Elementary School","06650001",null,"PK - 03","TA",415,null,"ES",88,132.80000000000001]
["0665","Assawompset Elementary School","06650002",null,"K - 03","NT",452,null,"ES",90,144]
["0665","George R Austin Intermediate School","06650015",null,"04 - 06","TA",426,null,"ES",86,137.6]
["0665","Freetown-Lakeville Middle School","06650305",null,"06 - 09","NT",668,null,"MS",140,224]
["0665","Apponequet Regional High","06650505",null,"09 - 12","NT",747,null,"HS",121,193.60000000000002]
["0670","Frontier Regional","06700505",null,"07 - 12","TA",650,null,"MSHS/K-12",138,214.4]
["0672","Chester Elementary","06720059",null,"PK - 05","SW",104,null,"ES",42,59.2]
["0672","Littleville Elementary School","06720143",null,"PK - 06","NT",335,null,"ES",146,217.60000000000002]
["0672","Gateway Regional Middle School","06720405",null,"07 - 08","NT",126,null,"MS",47,75.2]
["0672","Gateway Regional High","06720505",null,"09 - 12","NT",196,null,"HS",63,96]
["0673","Boutwell School","06730001",null,"PK","NT",40,null,"EES",8,0]
["0673","Swallow/Union School","06730005",null,"K - 04","NT",280,null,"ES",22,35.200000000000003]
["0673","Florence Roche School","06730010",null,"K - 04","TA",508,null,"ES",52,83.2]
["0673","Groton Dunstable Regional Middle","06730305",null,"05 - 08","TA",697,null,"MS",49,78.400000000000006]
["0673","Groton Dunstable Regional","06730505",null,"09 - 12","NT",722,null,"HS",50,76.800000000000011]
["0674","Gill Elementary","06740005",null,"K - 06","NT",109,null,"ES",39,62.400000000000006]
["0674","Hillcrest Elementary School","06740015",null,"PK - 01","SW",124,null,"EES",66,81.600000000000009]
["0674","Sheffield Elementary School","06740050",null,"02 - 05","SW",212,null,"ES",125,200]
["0674","Great Falls Middle","06740310",null,"06 - 08","NT",209,null,"MS",126,201.60000000000002]
["0674","Turners Fall High","06740505",null,"09 - 12","NT",193,null,"HS",91,139.20000000000002]
["0675","Bessie Buker Elementary","06750007",null,"K - 05","TA",223,null,"ES",12,19.200000000000003]
["0675","Cutler School","06750010",null,"K - 05","NT",254,null,"ES",26,41.6]
["0675","Winthrop School","06750015",null,"PK - 05","TA",295,null,"ES",23,32]
["0675","Miles River Middle","06750310",null,"06 - 08","NT",381,null,"MS",29,46.400000000000006]
["0675","Hamilton-Wenham Regional High","06750505",null,"09 - 12","NT",520,null,"HS",37,59.2]
["0680","Green Meadows Elementary","06800005",null,"PK - 08","TA",336,null,"ESMS",95,136]
["0680","Mile Tree Elementary","06800025",null,"PK - 01","TA",339,null,"EES",58,80]
["0680","Soule Road","06800030",null,"04 - 05","TA",313,null,"ES",66,105.60000000000001]
["0680","Stony Hill School","06800050",null,"02 - 03","TA",287,null,"ES",55,88]
["0680","Wilbraham Middle","06800310",null,"06 - 08","NT",583,null,"MS",129,206.4]
["0680","Minnechaug Regional High","06800505",null,"09 - 12","NT",1018,null,"HS",185,296]
["0683","Hampshire Regional High","06830505",null,"07 - 12","TA",679,null,"MSHS/K-12",124,195.20000000000002]
["0685","Hawlemont Regional","06850005",null,"PK - 06","SW",116,null,"ES",63,94.4]
["0690","King Philip Regional High","06900505",null,"09 - 12","NT",1204,null,"HS",119,187.20000000000002]
["0690","King Philip Middle School","06900510",null,"07 - 08","TA",740,null,"MS",108,172.8]
["0695","Lincoln-Sudbury Regional High","06950505",null,"09 - 12","TA",1517,null,"HS",112,172.8]
["0698","Manchester Memorial Elementary","06980010",null,"PK - 05","NT",269,null,"ES",23,33.6]
["0698","Essex Elementary","06980020",null,"K - 05","TA",185,null,"ES",33,52.800000000000004]
["0698","Manchester Essex Regional Middle School","06980030",null,"06 - 08","NT",334,null,"MS",35,56]
["0698","Manchester Essex Regional High School","06980510",null,"09 - 12","NT",454,null,"HS",60,96]
["0700","Martha's Vineyard Regional High","07000505",null,"09 - 12","TA",686,null,"HS",231,366.40000000000003]
["0705","Masconomet Regional Middle School","07050405",null,"07 - 08","TA",576,null,"MS",42,67.2]
["0705","Masconomet Regional High School","07050505",null,"09 - 12","NT",1110,null,"HS",94,150.4]
["0710","Memorial School","07100001",null,"PK - 04","TA",469,null,"ES",56,80]
["0710","Miscoe Hill School","07100015",null,"05 - 08","TA",721,null,"MS",92,147.20000000000002]
["0710","Henry P Clough","07100179",null,"PK - 04","NT",337,null,"ES",31,46.400000000000006]
["0710","Nipmuc Regional High","07100510",null,"09 - 12","NT",631,null,"HS",60,96]
["0712","Chatham Elementary School","07120001",null,"PK - 04","SW",155,null,"ES",67,107.2]
["0712","Harwich Elementary School","07120002",null,"PK - 04","SW",482,null,"ES",156,230.4]
["0712","Monomoy Regional Middle School","07120315",null,"05 - 07","NT",449,null,"MS",149,238.4]
["0712","Monomoy Regional High School","07120515",null,"08 - 12","NT",670,null,"MSHS/K-12",196,305.60000000000002]
["0715","Lanesborough Elementary","07150005",null,"PK - 06","TA",187,null,"ES",56,83.2]
["0715","Williamstown Elementary","07150010",null,"PK - 06","TA",371,null,"ES",75,113.60000000000001]
["0715","Mt Greylock Regional High","07150505",null,"07 - 12","NT",512,null,"MSHS/K-12",82,129.6]
["0717","Buckland-Shelburne Regional","07170005",null,"PK - 06","SW",246,null,"ES",97,148.80000000000001]
["0717","Colrain Central","07170010",null,"PK - 06","SW",85,null,"ES",42,60.800000000000004]
["0717","Sanderson Academy","07170020",null,"PK - 06","SW",120,null,"ES",33,41.6]
["0717","Mohawk Trail Regional School","07170505",null,"07 - 12","TA",277,null,"MSHS/K-12",95,148.80000000000001]
["0720","Templeton Elementary School","07200020",null,"PK - 04","SW",585,null,"ES",203,297.60000000000002]
["0720","Narragansett Middle","07200305",null,"05 - 07","NT",338,null,"MS",112,179.20000000000002]
["0720","Narragansett Regional High","07200505",null,"08 - 12","NT",413,null,"MSHS/K-12",132,208]
["0725","Mary Rowlandson Elementary","07250010",null,"PK - 05","TA",437,null,"ES",90,131.20000000000002]
["0725","Center School","07250020",null,"PK - 05","NT",469,null,"ES",24,36.800000000000004]
["0725","Florence Sawyer School","07250025",null,"PK - 08","NT",723,null,"ESMS",54,83.2]
["0725","Luther Burbank Middle School","07250305",null,"06 - 08","TA",238,null,"MS",53,84.800000000000011]
["0725","Hale","07250310",null,"06 - 08","NT",291,null,"MS",22,35.200000000000003]
["0725","Nashoba Regional","07250505",null,"09 - 12","NT",901,null,"HS",76,113.60000000000001]
["0728","Swift River","07280015",null,"PK - 06","TA",124,null,"ES",39,60.800000000000004]
["0730","Algonquin Regional High","07300505",null,"09 - 12","TA",1352,null,"HS",133,206.4]
["0735","Squannacook Early Childhood Center","07350002",null,"PK - 01, 03 -04","NT",63,null,"ES",26,9.6000000000000014]
["0735","Spaulding Memorial","07350005",null,"K - 04","SW",400,null,"ES",106,169.60000000000002]
["0735","Ashby Elementary","07350010",null,"K - 04","SW",167,null,"ES",50,80]
["0735","Hawthorne Brook","07350030",null,"05 - 08","NT",490,null,"MS",130,208]
["0735","Varnum Brook","07350035",null,"K - 04","SW",501,null,"ES",114,182.4]
["0735","Nissitissit Middle School","07350310",null,"05 - 08","NT",493,null,"MS",105,168]
["0735","North Middlesex Regional","07350505",null,"09 - 12","NT",786,null,"HS",124,193.60000000000002]
["0740","Old Rochester Regional Jr High","07400405",null,"07 - 08","TA",414,null,"MS",75,120]
["0740","Old Rochester Regional High","07400505",null,"09 - 12","NT",716,null,"HS",104,158.4]
["0745","Elmer S Bagnall","07450005",null,"PK - 06","NT",464,null,"ES",58,88]
["0745","Helen R Donaghue School","07450010",null,"03 - 06","TA",233,null,"ES",33,52.800000000000004]
["0745","Dr John C Page School","07450015",null,"PK - 06","NT",297,null,"ES",27,41.6]
["0745","Dr Frederick N Sweetsir","07450020",null,"PK - 02","TA",206,null,"EES",38,46.400000000000006]
["0745","Pentucket Regional Middle","07450405",null,"07 - 08","NT",345,null,"MS",56,89.600000000000009]
["0745","Pentucket Regional Sr High","07450505",null,"09 - 12","NT",669,null,"HS",77,123.2]
["0750","Bernardston Elementary","07500006",null,"PK - 06","TA",184,null,"ES",57,86.4]
["0750","Northfield Elementary","07500008",null,"PK - 06","TA",168,null,"ES",69,105.60000000000001]
["0750","Pioneer Valley Regional","07500505",null,"07 - 12","NT",279,null,"MSHS/K-12",71,113.60000000000001]
["0753","Hardwick Elementary","07530005",null,"PK - 05","SW",201,null,"ES",104,144]
["0753","Hubbardston Center","07530010",null,"K - 05","NT",242,null,"ES",48,76.800000000000011]
["0753","New Braintree Grade","07530020",null,"K - 01","NT",49,null,"EES",14,22.400000000000002]
["0753","Oakham Center","07530025",null,"02 - 05","NT",130,null,"ES",39,62.400000000000006]
["0753","Ruggles Lane","07530030",null,"PK - 05","SW",349,null,"ES",138,200]
["0753","Quabbin Regional Middle School","07530405",null,"06 - 08","NT",509,null,"MS",156,249.60000000000002]
["0753","Quabbin Regional High School","07530505",null,"09 - 12","NT",612,null,"HS",158,246.4]
["0755","Ralph C Mahar Regional","07550505",null,"07 - 12","SW",609,null,"MSHS/K-12",297,475.20000000000005]
["0760","Silver Lake Regional Middle School","07600405",null,"07 - 08","TA",522,null,"MS",102,163.20000000000002]
["0760","Silver Lake Regional High","07600505",null,"PK,09 - 12","TA",1198,null,"HS",219,291.2]
["0763","Somerset Berkley Regional High School","07630505",null,"09 - 12","TA",998,null,"HS",175,272]
["0765","New Marlborough Central","07650018",null,"PK - 04","NT",82,null,"ES",24,33.6]
["0765","South Egremont","07650030",null,"K","NT",16,null,"EES",1,1.6]
["0765","Undermountain","07650035",null,"PK - 05","TA",235,null,"ES",95,124.80000000000001]
["0765","Mt Everett Regional","07650505",null,"06 - 12","NT",321,null,"MSHS/K-12",120,192]
["0766","Woodland School","07660010",null,"PK - 02","SW",302,null,"EES",88,129.6]
["0766","Powder Mill School","07660315",null,"03 - 06","NT",422,null,"ES",145,232]
["0766","Southwick Regional School","07660505",null,"07 - 12","NT",669,null,"MSHS/K-12",158,252.8]
["0767","East Brookfield Elementary","07670008",null,"PK - 06","SW",192,null,"ES",68,80]
["0767","Wire Village School","07670040",null,"K - 04","SW",432,null,"ES",204,326.40000000000003]
["0767","Knox Trail Middle School","07670415",null,"05 - 08","SW",406,null,"MS",178,284.8]
["0767","David Prouty High","07670505",null,"09 - 12","NT",293,null,"HS",130,203.20000000000002]
["0770","Tantasqua Regional Jr High","07700405",null,"07 - 08","TA",582,null,"MS",133,212.8]
["0770","Tantasqua Regional Sr High","07700505",null,"09 - 12","TA",685,null,"HS",133,211.20000000000002]
["0770","Tantasqua Regional Vocational","07700605",null,"09 - 12","TA",496,null,"HS",144,230.4]
["0773","Salisbury Elementary","07730015",null,"PK - 06","SW",430,null,"ES",193,294.40000000000003]
["0773","Newbury Elementary","07730020",null,"PK - 06","NT",354,null,"ES",58,78.400000000000006]
["0773","Pine Grove","07730025",null,"PK - 06","NT",394,null,"ES",77,110.4]
["0773","Triton Regional Middle School","07730405",null,"07 - 08","NT",361,null,"MS",101,161.60000000000002]
["0773","Triton Regional High School","07730505",null,"09 - 12","NT",636,null,"HS",144,230.4]
["0774","Chilmark Elementary","07740010",null,"K - 05","TA",51,null,"ES",4,6.4]
["0774","West Tisbury Elementary","07740020",null,"PK - 08","TA",360,null,"ESMS",88,136]
["0775","Early Childhood Center","07750001",null,"PK","NT",108,null,"EES",22,0]
["0775","Naquag Elementary School","07750005",null,"K - 02","TA",295,null,"EES",44,70.400000000000006]
["0775","Davis Hill Elementary","07750018",null,"K - 05","TA",421,null,"ES",53,84.800000000000011]
["0775","Dawson","07750020",null,"K - 05","TA",444,null,"ES",50,80]
["0775","Houghton Elementary","07750027",null,"K - 04","TA",306,null,"ES",53,84.800000000000011]
["0775","Leroy E.Mayo","07750032",null,"K - 05","TA",477,null,"ES",68,108.80000000000001]
["0775","Paxton Center","07750040",null,"K - 08","NT",443,null,"ESMS",70,112]
["0775","Thomas Prince","07750045",null,"K - 08","NT",340,null,"ESMS",28,44.800000000000004]
["0775","Glenwood Elementary School","07750060",null,"03 - 05","TA",346,null,"ES",56,89.600000000000009]
["0775","Mountview Middle","07750305",null,"06 - 08","NT",769,null,"MS",98,156.80000000000001]
["0775","Central Tree Middle","07750310",null,"06 - 08","NT",347,null,"MS",70,112]
["0775","Chocksett Middle School","07750315",null,"05 - 08","NT",299,null,"MS",46,73.600000000000009]
["0775","Wachusett Regional High","07750505",null,"09 - 12","NT",1986,null,"HS",259,403.20000000000005]
["0778","Warren Elementary","07780005",null,"PK - 06","SW",368,null,"ES",191,291.2]
["0778","West Brookfield Elementary","07780010",null,"PK - 06","SW",248,null,"ES",90,129.6]
["0778","Quaboag Regional Middle Innovation School","07780305",null,"07 - 08","NT",171,null,"MS",76,121.60000000000001]
["0778","Quaboag Regional High","07780505",null,"09 - 12","NT",356,null,"HS",123,196.8]
["0780","The Pre-School Academy at Whitman Hanson","07800001",null,"PK","NT",92,null,"EES",28,0]
["0780","Louise A Conley","07800010",null,"K - 05","TA",503,null,"ES",100,160]
["0780","John H Duval","07800030",null,"K - 05","TA",420,null,"ES",150,240]
["0780","Indian Head","07800035",null,"K - 04","NT",474,null,"ES",98,156.80000000000001]
["0780","Whitman Middle","07800310",null,"06 - 08","TA",550,null,"MS",148,236.8]
["0780","Hanson Middle School","07800315",null,"05 - 08","NT",458,null,"MS",87,139.20000000000002]
["0780","Whitman Hanson Regional","07800505",null,"09 - 12","NT",1105,null,"HS",229,360]
["0801","Assabet Valley Vocational High School","08010605",null,"09 - 12","TA",1135,null,"HS",369,590.4]
["0805","Blackstone Valley","08050605",null,"09 - 12","TA",1229,null,"HS",123,196.8]
["0806","Blue Hills Regional Vocational Technical","08060605",null,"09 - 12","SW",878,null,"HS",276,441.6]
["0810","Bristol-Plymouth Vocational Technical","08100605",null,"09 - 12","SW",1304,null,"HS",383,612.80000000000007]
["0815","Cape Cod Region Vocational Technical","08150605",null,"09 - 12","SW",623,null,"HS",293,468.8]
["0817","Essex North Shore Agricultural and Technical School","08170505",null,"09 - 12","TA",1559,null,"HS",293,468.8]
["0818","Franklin County Technical","08180605",null,"09 - 12","SW",542,null,"HS",219,350.40000000000003]
["0821","Diman Regional Vocational Technical High","08210605",null,"09 - 12","SW",1440,null,"HS",597,955.2]
["0823","Gr Lawrence Regional Vocational Technical","08230605",null,"09 - 12","SW",1626,null,"HS",988,1580.8000000000002]
["0825","Gr New Bedford Vocational Technical","08250605",null,"09 - 12","SW",2083,null,"HS",870,1392]
["0828","Gr Lowell Regional Vocational Technical","08280605",null,"09 - 12","SW",2275,null,"HS",1114,1760]
["0829","Joseph P Keefe Technical High School","08290605",null,"09 - 12","SW",807,null,"HS",408,652.80000000000007]
["0830","Minuteman Regional High","08300605",null,"09 - 12","SW",632,null,"HS",118,188.8]
["0832","Montachusett Regional Vocational Technical","08320605",null,"09 - 12","TA",1399,null,"HS",383,612.80000000000007]
["0851","Charles McCann Vocational Technical","08510605",null,"09 - 12","SW",487,null,"HS",184,294.40000000000003]
["0852","Nashoba Valley Technical High School","08520605",null,"09 - 12","SW",730,null,"HS",170,272]
["0853","Northeast Metro Regional Vocational","08530605",null,"09 - 12","SW",1281,null,"HS",540,864]
["0855","Old Colony Regional Vocational Technical","08550605",null,"09 - 12","TA",559,null,"HS",107,171.20000000000002]
["0860","Pathfinder Vocational Technical","08600605",null,"09 - 12","SW",603,null,"HS",229,366.40000000000003]
["0871","Shawsheen Valley Vocational Technical High School","08710605",null,"09 - 12","SW",1300,null,"HS",212,339.20000000000005]
["0872","Southeastern Regional Vocational Technical","08720605",null,"09 - 12","SW",1525,null,"HS",585,936]
["0873","So Shore Vocational Technical High","08730605",null,"09 - 12","TA",639,null,"HS",155,248]
["0876","Bay Path Regional Vocational Technical High School","08760605",null,"09 - 12","TA",1154,null,"HS",297,475.20000000000005]
["0878","Tri-County Regional Vocational Technical","08780605",null,"09 - 12","TA",943,null,"HS",190,304]
["0879","Upper Cape Cod Vocational Technical","08790605",null,"09 - 12","TA",711,null,"HS",240,384]
["0885","Whittier Regional Vocational","08850605",null,"09 - 12","SW",1234,null,"HS",429,686.40000000000009]
["0910","Bristol County Agricultural High","09100705",null,"09 - 12","TA",440,null,"HS",110,176]
["0915","Norfolk County Agricultural","09150705",null,"09 - 12","TA",580,null,"HS",94,150.4]
["3501","Paulo Freire Social Justice Charter School","35010505",null,"09 - 12","SW",261,null,"HS",214,342.40000000000003]
["3502","Baystate Academy Charter Public School","35020405",null,"06 - 12","SW",473,null,"MSHS/K-12",359,574.4]
["3503","Collegiate Charter School of Lowell","35030205",null,"K - 10","SW",1018,null,"MSHS/K-12",546,873.6]
["3505","UP Academy Charter School of Dorchester","35050405",null,"PK - 08","SW",688,null,"ESMS",519,756.80000000000007]
["3506","Pioneer Charter School of Science II (PCSS-II)","35060505",null,"07 - 12","SW",362,null,"MSHS/K-12",117,187.20000000000002]
["3508","Phoenix Academy Public Charter High School Springfield","35080505",null,"09 - 12","SW",204,null,"HS",170,272]
["3509","Argosy Collegiate Charter School","35090305",null,"06 - 12","SW",567,null,"MSHS/K-12",374,598.4]
["3510","Springfield Preparatory Charter School","35100205",null,"K - 06","SW",380,null,"ES",272,435.20000000000005]
["3513","New Heights Charter School of Brockton","35130305",null,"06 - 12","SW",741,null,"MSHS/K-12",365,584]
["3514","Libertas Academy Charter School","35140305",null,"06 - 08","SW",260,null,"MS",216,345.6]
["3515","Old Sturbridge Academy Charter Public School","35150205",null,"K - 06","SW",280,null,"ES",98,156.80000000000001]
["3516","Hampden Charter School of Science West","35160305",null,"06 - 11","SW",321,null,"MSHS/K-12",168,268.8]
["3517","Map Academy Charter School","35170505",null,"09 - 12","SW",197,null,"HS",114,182.4]
["3518","Phoenix Academy Public Charter High School Lawrence","35180505",null,"09 - 12","SW",152,null,"HS",124,198.4]
["3901","Greenfield Commonwealth Virtual School","39010900",null,"K - 12","SW",1044,null,"MSHS/K-12",521,832]
["3902","TEC Connections Academy Commonwealth Virtual School","39020900",null,"K - 12","SW",2546,null,"MSHS/K-12",1127,1803.2]